BDBM50504912 CHEMBL4451500
SMILES: CCCCNC(=O)c1cc(c(Cl)cc1SC1CCCCC1)S(N)(=O)=O
InChI Key: InChIKey=WZHPNNQXMINMAU-UHFFFAOYSA-N
Data: 24 Kd
Activity Spreadsheet -- Enzyme Inhibition Constant Data from BindingDB
Found 24 hits for monomerid = 50504912
Trg + Lig
Ki
nM
ΔG°
kcal/mole
IC50
nM
Kd
nM
EC50/IC50
nM
koff
s-1
kon
M-1s-1
pHTemp
°C
Carbonic anhydrase
(Homo sapiens (Human))
BDBM50504912
(CHEMBL4451500)
Show SMILES CCCCNC(=O)c1cc(c(Cl)cc1SC1CCCCC1)S(N)(=O)=O
Show InChI InChI=1S/C17H25ClN2O3S2/c1-2-3-9-20-17(21)13-10-16(25(19,22)23)14(18)11-15(13)24-12-7-5-4-6-8-12/h10-12H,2-9H2,1H3,(H,20,21)(H2,19,22,23)
Reactome pathway
n/an/an/a 24n/an/an/an/an/a
Vilnius University
Curated by ChEMBL
Assay Description
Binding affinity to recombinant human carbonic anhydrase 3 expressed in Escherichia coli expression system assessed as kinetic dissociation constant ...
Eur J Med Chem 185: (2020)
Article DOI: 10.1016/j.ejmech.2019.111825
Carbonic anhydrase 2
(Homo sapiens (Human))
BDBM50504912
(CHEMBL4451500)
Show SMILES CCCCNC(=O)c1cc(c(Cl)cc1SC1CCCCC1)S(N)(=O)=O
Show InChI InChI=1S/C17H25ClN2O3S2/c1-2-3-9-20-17(21)13-10-16(25(19,22)23)14(18)11-15(13)24-12-7-5-4-6-8-12/h10-12H,2-9H2,1H3,(H,20,21)(H2,19,22,23)
Reactome pathway
n/an/an/a 2.5n/an/an/an/an/a
Vilnius University
Curated by ChEMBL
Assay Description
Binding affinity to recombinant human carbonic anhydrase 2 expressed in Escherichia coli expression system assessed as observed dissociation constant...
Eur J Med Chem 185: (2020)
Article DOI: 10.1016/j.ejmech.2019.111825
Carbonic anhydrase
(Homo sapiens (Human))
BDBM50504912
(CHEMBL4451500)
Show SMILES CCCCNC(=O)c1cc(c(Cl)cc1SC1CCCCC1)S(N)(=O)=O
Show InChI InChI=1S/C17H25ClN2O3S2/c1-2-3-9-20-17(21)13-10-16(25(19,22)23)14(18)11-15(13)24-12-7-5-4-6-8-12/h10-12H,2-9H2,1H3,(H,20,21)(H2,19,22,23)
Reactome pathway
n/an/an/a 0.00200n/an/an/an/an/a
Vilnius University
Curated by ChEMBL
Assay Description
Binding affinity to recombinant human carbonic anhydrase 12 expressed in Escherichia coli expression system assessed as kinetic dissociation constant...
Eur J Med Chem 185: (2020)
Article DOI: 10.1016/j.ejmech.2019.111825
Carbonic anhydrase
(Homo sapiens (Human))
BDBM50504912
(CHEMBL4451500)
Show SMILES CCCCNC(=O)c1cc(c(Cl)cc1SC1CCCCC1)S(N)(=O)=O
Show InChI InChI=1S/C17H25ClN2O3S2/c1-2-3-9-20-17(21)13-10-16(25(19,22)23)14(18)11-15(13)24-12-7-5-4-6-8-12/h10-12H,2-9H2,1H3,(H,20,21)(H2,19,22,23)
Reactome pathway
n/an/an/a 0.530n/an/an/an/an/a
Vilnius University
Curated by ChEMBL
Assay Description
Binding affinity to recombinant human carbonic anhydrase 7 expressed in Escherichia coli expression system assessed as observed dissociation constant...
Eur J Med Chem 185: (2020)
Article DOI: 10.1016/j.ejmech.2019.111825
Carbonic anhydrase
(Homo sapiens (Human))
BDBM50504912
(CHEMBL4451500)
Show SMILES CCCCNC(=O)c1cc(c(Cl)cc1SC1CCCCC1)S(N)(=O)=O
Show InChI InChI=1S/C17H25ClN2O3S2/c1-2-3-9-20-17(21)13-10-16(25(19,22)23)14(18)11-15(13)24-12-7-5-4-6-8-12/h10-12H,2-9H2,1H3,(H,20,21)(H2,19,22,23)
Reactome pathway
n/an/an/a 0.5n/an/an/an/an/a
Vilnius University
Curated by ChEMBL
Assay Description
Binding affinity to recombinant human carbonic anhydrase 12 expressed in Escherichia coli expression system assessed as observed dissociation constan...
Eur J Med Chem 185: (2020)
Article DOI: 10.1016/j.ejmech.2019.111825
Carbonic anhydrase
(Homo sapiens (Human))
BDBM50504912
(CHEMBL4451500)
Show SMILES CCCCNC(=O)c1cc(c(Cl)cc1SC1CCCCC1)S(N)(=O)=O
Show InChI InChI=1S/C17H25ClN2O3S2/c1-2-3-9-20-17(21)13-10-16(25(19,22)23)14(18)11-15(13)24-12-7-5-4-6-8-12/h10-12H,2-9H2,1H3,(H,20,21)(H2,19,22,23)
n/an/an/a 25n/an/an/an/an/a
Vilnius University
Curated by ChEMBL
Assay Description
Binding affinity to recombinant human carbonic anhydrase 13 expressed in Escherichia coli expression system assessed as observed dissociation constan...
Eur J Med Chem 185: (2020)
Article DOI: 10.1016/j.ejmech.2019.111825
Carbonic anhydrase
(Homo sapiens (Human))
BDBM50504912
(CHEMBL4451500)
Show SMILES CCCCNC(=O)c1cc(c(Cl)cc1SC1CCCCC1)S(N)(=O)=O
Show InChI InChI=1S/C17H25ClN2O3S2/c1-2-3-9-20-17(21)13-10-16(25(19,22)23)14(18)11-15(13)24-12-7-5-4-6-8-12/h10-12H,2-9H2,1H3,(H,20,21)(H2,19,22,23)
Reactome pathway
n/an/an/a 0.00200n/an/an/an/an/a
Vilnius University
Curated by ChEMBL
Assay Description
Binding affinity to recombinant human carbonic anhydrase 7 expressed in Escherichia coli expression system assessed as kinetic dissociation constant ...
Eur J Med Chem 185: (2020)
Article DOI: 10.1016/j.ejmech.2019.111825
Carbonic anhydrases; II & IX
(Homo sapiens (Human))
BDBM50504912
(CHEMBL4451500)
Show SMILES CCCCNC(=O)c1cc(c(Cl)cc1SC1CCCCC1)S(N)(=O)=O
Show InChI InChI=1S/C17H25ClN2O3S2/c1-2-3-9-20-17(21)13-10-16(25(19,22)23)14(18)11-15(13)24-12-7-5-4-6-8-12/h10-12H,2-9H2,1H3,(H,20,21)(H2,19,22,23)
NCI pathway
Reactome pathway
n/an/an/a 0.830n/an/an/an/an/a
Vilnius University
Curated by ChEMBL
Assay Description
Binding affinity to recombinant human carbonic anhydrase 9 expressed in mammalian cell expression system assessed as observed dissociation constant f...
Eur J Med Chem 185: (2020)
Article DOI: 10.1016/j.ejmech.2019.111825
Carbonic anhydrase V
(Homo sapiens (Human))
BDBM50504912
(CHEMBL4451500)
Show SMILES CCCCNC(=O)c1cc(c(Cl)cc1SC1CCCCC1)S(N)(=O)=O
Show InChI InChI=1S/C17H25ClN2O3S2/c1-2-3-9-20-17(21)13-10-16(25(19,22)23)14(18)11-15(13)24-12-7-5-4-6-8-12/h10-12H,2-9H2,1H3,(H,20,21)(H2,19,22,23)
Reactome pathway
n/an/an/a 0.0400n/an/an/an/an/a
Vilnius University
Curated by ChEMBL
Assay Description
Binding affinity to recombinant human carbonic anhydrase 5b expressed in Escherichia coli expression system assessed as kinetic dissociation constant...
Eur J Med Chem 185: (2020)
Article DOI: 10.1016/j.ejmech.2019.111825
Carbonic anhydrase
(Homo sapiens (Human))
BDBM50504912
(CHEMBL4451500)
Show SMILES CCCCNC(=O)c1cc(c(Cl)cc1SC1CCCCC1)S(N)(=O)=O
Show InChI InChI=1S/C17H25ClN2O3S2/c1-2-3-9-20-17(21)13-10-16(25(19,22)23)14(18)11-15(13)24-12-7-5-4-6-8-12/h10-12H,2-9H2,1H3,(H,20,21)(H2,19,22,23)
Reactome pathway
n/an/an/a 1.00E+4n/an/an/an/an/a
Vilnius University
Curated by ChEMBL
Assay Description
Binding affinity to recombinant human carbonic anhydrase 3 expressed in Escherichia coli expression system assessed as observed dissociation constant...
Eur J Med Chem 185: (2020)
Article DOI: 10.1016/j.ejmech.2019.111825
Carbonic anhydrase
(Homo sapiens (Human))
BDBM50504912
(CHEMBL4451500)
Show SMILES CCCCNC(=O)c1cc(c(Cl)cc1SC1CCCCC1)S(N)(=O)=O
Show InChI InChI=1S/C17H25ClN2O3S2/c1-2-3-9-20-17(21)13-10-16(25(19,22)23)14(18)11-15(13)24-12-7-5-4-6-8-12/h10-12H,2-9H2,1H3,(H,20,21)(H2,19,22,23)
n/an/an/a 0.450n/an/an/an/an/a
Vilnius University
Curated by ChEMBL
Assay Description
Binding affinity to recombinant human carbonic anhydrase 6 expressed in Escherichia coli expression system assessed as kinetic dissociation constant ...
Eur J Med Chem 185: (2020)
Article DOI: 10.1016/j.ejmech.2019.111825
Carbonic anhydrase V
(Homo sapiens (Human))
BDBM50504912
(CHEMBL4451500)
Show SMILES CCCCNC(=O)c1cc(c(Cl)cc1SC1CCCCC1)S(N)(=O)=O
Show InChI InChI=1S/C17H25ClN2O3S2/c1-2-3-9-20-17(21)13-10-16(25(19,22)23)14(18)11-15(13)24-12-7-5-4-6-8-12/h10-12H,2-9H2,1H3,(H,20,21)(H2,19,22,23)
Reactome pathway
n/an/an/a 400n/an/an/an/an/a
Vilnius University
Curated by ChEMBL
Assay Description
Binding affinity to recombinant human carbonic anhydrase 5a expressed in Escherichia coli expression system assessed as observed dissociation constan...
Eur J Med Chem 185: (2020)
Article DOI: 10.1016/j.ejmech.2019.111825
Carbonic anhydrase V
(Homo sapiens (Human))
BDBM50504912
(CHEMBL4451500)
Show SMILES CCCCNC(=O)c1cc(c(Cl)cc1SC1CCCCC1)S(N)(=O)=O
Show InChI InChI=1S/C17H25ClN2O3S2/c1-2-3-9-20-17(21)13-10-16(25(19,22)23)14(18)11-15(13)24-12-7-5-4-6-8-12/h10-12H,2-9H2,1H3,(H,20,21)(H2,19,22,23)
Reactome pathway
n/an/an/a 8.30n/an/an/an/an/a
Vilnius University
Curated by ChEMBL
Assay Description
Binding affinity to recombinant human carbonic anhydrase 5b expressed in Escherichia coli expression system assessed as observed dissociation constan...
Eur J Med Chem 185: (2020)
Article DOI: 10.1016/j.ejmech.2019.111825
Carbonic anhydrase
(Homo sapiens (Human))
BDBM50504912
(CHEMBL4451500)
Show SMILES CCCCNC(=O)c1cc(c(Cl)cc1SC1CCCCC1)S(N)(=O)=O
Show InChI InChI=1S/C17H25ClN2O3S2/c1-2-3-9-20-17(21)13-10-16(25(19,22)23)14(18)11-15(13)24-12-7-5-4-6-8-12/h10-12H,2-9H2,1H3,(H,20,21)(H2,19,22,23)
n/an/an/a 0.230n/an/an/an/an/a
Vilnius University
Curated by ChEMBL
Assay Description
Binding affinity to recombinant human carbonic anhydrase 13 expressed in Escherichia coli expression system assessed as kinetic dissociation constant...
Eur J Med Chem 185: (2020)
Article DOI: 10.1016/j.ejmech.2019.111825
Carbonic anhydrase
(Homo sapiens (Human))
BDBM50504912
(CHEMBL4451500)
Show SMILES CCCCNC(=O)c1cc(c(Cl)cc1SC1CCCCC1)S(N)(=O)=O
Show InChI InChI=1S/C17H25ClN2O3S2/c1-2-3-9-20-17(21)13-10-16(25(19,22)23)14(18)11-15(13)24-12-7-5-4-6-8-12/h10-12H,2-9H2,1H3,(H,20,21)(H2,19,22,23)
NCI pathway
Reactome pathway
n/an/an/a 3.70n/an/an/an/an/a
Vilnius University
Curated by ChEMBL
Assay Description
Binding affinity to recombinant human carbonic anhydrase 1 expressed in Escherichia coli expression system assessed as kinetic dissociation constant ...
Eur J Med Chem 185: (2020)
Article DOI: 10.1016/j.ejmech.2019.111825
Carbonic anhydrase V
(Homo sapiens (Human))
BDBM50504912
(CHEMBL4451500)
Show SMILES CCCCNC(=O)c1cc(c(Cl)cc1SC1CCCCC1)S(N)(=O)=O
Show InChI InChI=1S/C17H25ClN2O3S2/c1-2-3-9-20-17(21)13-10-16(25(19,22)23)14(18)11-15(13)24-12-7-5-4-6-8-12/h10-12H,2-9H2,1H3,(H,20,21)(H2,19,22,23)
Reactome pathway
n/an/an/a 2.60n/an/an/an/an/a
Vilnius University
Curated by ChEMBL
Assay Description
Binding affinity to recombinant human carbonic anhydrase 5a expressed in Escherichia coli expression system assessed as kinetic dissociation constant...
Eur J Med Chem 185: (2020)
Article DOI: 10.1016/j.ejmech.2019.111825
Carbonic anhydrase
(Homo sapiens (Human))
BDBM50504912
(CHEMBL4451500)
Show SMILES CCCCNC(=O)c1cc(c(Cl)cc1SC1CCCCC1)S(N)(=O)=O
Show InChI InChI=1S/C17H25ClN2O3S2/c1-2-3-9-20-17(21)13-10-16(25(19,22)23)14(18)11-15(13)24-12-7-5-4-6-8-12/h10-12H,2-9H2,1H3,(H,20,21)(H2,19,22,23)
Reactome pathway
n/an/an/a 5n/an/an/an/an/a
Vilnius University
Curated by ChEMBL
Assay Description
Binding affinity to recombinant human carbonic anhydrase 4 expressed in Escherichia coli expression system assessed as observed dissociation constant...
Eur J Med Chem 185: (2020)
Article DOI: 10.1016/j.ejmech.2019.111825
Carbonic anhydrase
(Homo sapiens (Human))
BDBM50504912
(CHEMBL4451500)
Show SMILES CCCCNC(=O)c1cc(c(Cl)cc1SC1CCCCC1)S(N)(=O)=O
Show InChI InChI=1S/C17H25ClN2O3S2/c1-2-3-9-20-17(21)13-10-16(25(19,22)23)14(18)11-15(13)24-12-7-5-4-6-8-12/h10-12H,2-9H2,1H3,(H,20,21)(H2,19,22,23)
NCI pathway
Reactome pathway
n/an/an/a 400n/an/an/an/an/a
Vilnius University
Curated by ChEMBL
Assay Description
Binding affinity to recombinant human carbonic anhydrase 1 expressed in Escherichia coli expression system assessed as observed dissociation constant...
Eur J Med Chem 185: (2020)
Article DOI: 10.1016/j.ejmech.2019.111825
Carbonic anhydrase
(Homo sapiens (Human))
BDBM50504912
(CHEMBL4451500)
Show SMILES CCCCNC(=O)c1cc(c(Cl)cc1SC1CCCCC1)S(N)(=O)=O
Show InChI InChI=1S/C17H25ClN2O3S2/c1-2-3-9-20-17(21)13-10-16(25(19,22)23)14(18)11-15(13)24-12-7-5-4-6-8-12/h10-12H,2-9H2,1H3,(H,20,21)(H2,19,22,23)
n/an/an/a 500n/an/an/an/an/a
Vilnius University
Curated by ChEMBL
Assay Description
Binding affinity to recombinant human carbonic anhydrase 6 expressed in Escherichia coli expression system assessed as observed dissociation constant...
Eur J Med Chem 185: (2020)
Article DOI: 10.1016/j.ejmech.2019.111825
Carbonic anhydrase 2
(Homo sapiens (Human))
BDBM50504912
(CHEMBL4451500)
Show SMILES CCCCNC(=O)c1cc(c(Cl)cc1SC1CCCCC1)S(N)(=O)=O
Show InChI InChI=1S/C17H25ClN2O3S2/c1-2-3-9-20-17(21)13-10-16(25(19,22)23)14(18)11-15(13)24-12-7-5-4-6-8-12/h10-12H,2-9H2,1H3,(H,20,21)(H2,19,22,23)
Reactome pathway
n/an/an/a 0.0100n/an/an/an/an/a
Vilnius University
Curated by ChEMBL
Assay Description
Binding affinity to recombinant human carbonic anhydrase 2 expressed in Escherichia coli expression system assessed as kinetic dissociation constant ...
Eur J Med Chem 185: (2020)
Article DOI: 10.1016/j.ejmech.2019.111825
Carbonic anhydrase
(Homo sapiens (Human))
BDBM50504912
(CHEMBL4451500)
Show SMILES CCCCNC(=O)c1cc(c(Cl)cc1SC1CCCCC1)S(N)(=O)=O
Show InChI InChI=1S/C17H25ClN2O3S2/c1-2-3-9-20-17(21)13-10-16(25(19,22)23)14(18)11-15(13)24-12-7-5-4-6-8-12/h10-12H,2-9H2,1H3,(H,20,21)(H2,19,22,23)
Reactome pathway
n/an/an/a 2n/an/an/an/an/a
Vilnius University
Curated by ChEMBL
Assay Description
Binding affinity to recombinant human carbonic anhydrase 14 expressed in Escherichia coli expression system assessed as observed dissociation constan...
Eur J Med Chem 185: (2020)
Article DOI: 10.1016/j.ejmech.2019.111825
Carbonic anhydrases; II & IX
(Homo sapiens (Human))
BDBM50504912
(CHEMBL4451500)
Show SMILES CCCCNC(=O)c1cc(c(Cl)cc1SC1CCCCC1)S(N)(=O)=O
Show InChI InChI=1S/C17H25ClN2O3S2/c1-2-3-9-20-17(21)13-10-16(25(19,22)23)14(18)11-15(13)24-12-7-5-4-6-8-12/h10-12H,2-9H2,1H3,(H,20,21)(H2,19,22,23)
NCI pathway
Reactome pathway
n/an/an/a 0.00200n/an/an/an/an/a
Vilnius University
Curated by ChEMBL
Assay Description
Binding affinity to recombinant human carbonic anhydrase 9 expressed in mammalian cell expression system assessed as kinetic dissociation constant fl...
Eur J Med Chem 185: (2020)
Article DOI: 10.1016/j.ejmech.2019.111825
Carbonic anhydrase
(Homo sapiens (Human))
BDBM50504912
(CHEMBL4451500)
Show SMILES CCCCNC(=O)c1cc(c(Cl)cc1SC1CCCCC1)S(N)(=O)=O
Show InChI InChI=1S/C17H25ClN2O3S2/c1-2-3-9-20-17(21)13-10-16(25(19,22)23)14(18)11-15(13)24-12-7-5-4-6-8-12/h10-12H,2-9H2,1H3,(H,20,21)(H2,19,22,23)
Reactome pathway
n/an/an/a 0.00800n/an/an/an/an/a
Vilnius University
Curated by ChEMBL
Assay Description
Binding affinity to recombinant human carbonic anhydrase 14 expressed in Escherichia coli expression system assessed as kinetic dissociation constant...
Eur J Med Chem 185: (2020)
Article DOI: 10.1016/j.ejmech.2019.111825
Carbonic anhydrase
(Homo sapiens (Human))
BDBM50504912
(CHEMBL4451500)
Show SMILES CCCCNC(=O)c1cc(c(Cl)cc1SC1CCCCC1)S(N)(=O)=O
Show InChI InChI=1S/C17H25ClN2O3S2/c1-2-3-9-20-17(21)13-10-16(25(19,22)23)14(18)11-15(13)24-12-7-5-4-6-8-12/h10-12H,2-9H2,1H3,(H,20,21)(H2,19,22,23)
Reactome pathway
n/an/an/a 0.0100n/an/an/an/an/a
Vilnius University
Curated by ChEMBL
Assay Description
Binding affinity to recombinant human carbonic anhydrase 4 expressed in Escherichia coli expression system assessed as kinetic dissociation constant ...
Eur J Med Chem 185: (2020)
Article DOI: 10.1016/j.ejmech.2019.111825