BDBM50504930 CHEMBL4515586
SMILES: NS(=O)(=O)c1cc(C(=O)NCCO)c(SCCc2ccccc2)cc1Br
InChI Key: InChIKey=XWTWKKFMRZDTAA-UHFFFAOYSA-N
Data: 24 Kd
Activity Spreadsheet -- Enzyme Inhibition Constant Data from BindingDB
Found 24 hits for monomerid = 50504930
Trg + Lig
Ki
nM
ΔG°
kcal/mole
IC50
nM
Kd
nM
EC50/IC50
nM
koff
s-1
kon
M-1s-1
pHTemp
°C
Carbonic anhydrase
(Homo sapiens (Human))
BDBM50504930
(CHEMBL4515586)
Show SMILES NS(=O)(=O)c1cc(C(=O)NCCO)c(SCCc2ccccc2)cc1Br
Show InChI InChI=1S/C17H19BrN2O4S2/c18-14-11-15(25-9-6-12-4-2-1-3-5-12)13(17(22)20-7-8-21)10-16(14)26(19,23)24/h1-5,10-11,21H,6-9H2,(H,20,22)(H2,19,23,24)
Reactome pathway
n/an/an/a 60n/an/an/an/an/a
Vilnius University
Curated by ChEMBL
Assay Description
Binding affinity to recombinant human carbonic anhydrase 3 expressed in Escherichia coli expression system assessed as kinetic dissociation constant ...
Eur J Med Chem 185: (2020)
Article DOI: 10.1016/j.ejmech.2019.111825
Carbonic anhydrase
(Homo sapiens (Human))
BDBM50504930
(CHEMBL4515586)
Show SMILES NS(=O)(=O)c1cc(C(=O)NCCO)c(SCCc2ccccc2)cc1Br
Show InChI InChI=1S/C17H19BrN2O4S2/c18-14-11-15(25-9-6-12-4-2-1-3-5-12)13(17(22)20-7-8-21)10-16(14)26(19,23)24/h1-5,10-11,21H,6-9H2,(H,20,22)(H2,19,23,24)
NCI pathway
Reactome pathway
n/an/an/a 4.00E+3n/an/an/an/an/a
Vilnius University
Curated by ChEMBL
Assay Description
Binding affinity to recombinant human carbonic anhydrase 1 expressed in Escherichia coli expression system assessed as observed dissociation constant...
Eur J Med Chem 185: (2020)
Article DOI: 10.1016/j.ejmech.2019.111825
Carbonic anhydrase
(Homo sapiens (Human))
BDBM50504930
(CHEMBL4515586)
Show SMILES NS(=O)(=O)c1cc(C(=O)NCCO)c(SCCc2ccccc2)cc1Br
Show InChI InChI=1S/C17H19BrN2O4S2/c18-14-11-15(25-9-6-12-4-2-1-3-5-12)13(17(22)20-7-8-21)10-16(14)26(19,23)24/h1-5,10-11,21H,6-9H2,(H,20,22)(H2,19,23,24)
Reactome pathway
n/an/an/a 0.290n/an/an/an/an/a
Vilnius University
Curated by ChEMBL
Assay Description
Binding affinity to recombinant human carbonic anhydrase 4 expressed in Escherichia coli expression system assessed as kinetic dissociation constant ...
Eur J Med Chem 185: (2020)
Article DOI: 10.1016/j.ejmech.2019.111825
Carbonic anhydrase
(Homo sapiens (Human))
BDBM50504930
(CHEMBL4515586)
Show SMILES NS(=O)(=O)c1cc(C(=O)NCCO)c(SCCc2ccccc2)cc1Br
Show InChI InChI=1S/C17H19BrN2O4S2/c18-14-11-15(25-9-6-12-4-2-1-3-5-12)13(17(22)20-7-8-21)10-16(14)26(19,23)24/h1-5,10-11,21H,6-9H2,(H,20,22)(H2,19,23,24)
n/an/an/a 4.50E+3n/an/an/an/an/a
Vilnius University
Curated by ChEMBL
Assay Description
Binding affinity to recombinant human carbonic anhydrase 6 expressed in Escherichia coli expression system assessed as observed dissociation constant...
Eur J Med Chem 185: (2020)
Article DOI: 10.1016/j.ejmech.2019.111825
Carbonic anhydrase
(Homo sapiens (Human))
BDBM50504930
(CHEMBL4515586)
Show SMILES NS(=O)(=O)c1cc(C(=O)NCCO)c(SCCc2ccccc2)cc1Br
Show InChI InChI=1S/C17H19BrN2O4S2/c18-14-11-15(25-9-6-12-4-2-1-3-5-12)13(17(22)20-7-8-21)10-16(14)26(19,23)24/h1-5,10-11,21H,6-9H2,(H,20,22)(H2,19,23,24)
Reactome pathway
n/an/an/a 14n/an/an/an/an/a
Vilnius University
Curated by ChEMBL
Assay Description
Binding affinity to recombinant human carbonic anhydrase 12 expressed in Escherichia coli expression system assessed as observed dissociation constan...
Eur J Med Chem 185: (2020)
Article DOI: 10.1016/j.ejmech.2019.111825
Carbonic anhydrase
(Homo sapiens (Human))
BDBM50504930
(CHEMBL4515586)
Show SMILES NS(=O)(=O)c1cc(C(=O)NCCO)c(SCCc2ccccc2)cc1Br
Show InChI InChI=1S/C17H19BrN2O4S2/c18-14-11-15(25-9-6-12-4-2-1-3-5-12)13(17(22)20-7-8-21)10-16(14)26(19,23)24/h1-5,10-11,21H,6-9H2,(H,20,22)(H2,19,23,24)
n/an/an/a 2.60n/an/an/an/an/a
Vilnius University
Curated by ChEMBL
Assay Description
Binding affinity to recombinant human carbonic anhydrase 6 expressed in Escherichia coli expression system assessed as kinetic dissociation constant ...
Eur J Med Chem 185: (2020)
Article DOI: 10.1016/j.ejmech.2019.111825
Carbonic anhydrase
(Homo sapiens (Human))
BDBM50504930
(CHEMBL4515586)
Show SMILES NS(=O)(=O)c1cc(C(=O)NCCO)c(SCCc2ccccc2)cc1Br
Show InChI InChI=1S/C17H19BrN2O4S2/c18-14-11-15(25-9-6-12-4-2-1-3-5-12)13(17(22)20-7-8-21)10-16(14)26(19,23)24/h1-5,10-11,21H,6-9H2,(H,20,22)(H2,19,23,24)
n/an/an/a 18n/an/an/an/an/a
Vilnius University
Curated by ChEMBL
Assay Description
Binding affinity to recombinant human carbonic anhydrase 13 expressed in Escherichia coli expression system assessed as observed dissociation constan...
Eur J Med Chem 185: (2020)
Article DOI: 10.1016/j.ejmech.2019.111825
Carbonic anhydrase V
(Homo sapiens (Human))
BDBM50504930
(CHEMBL4515586)
Show SMILES NS(=O)(=O)c1cc(C(=O)NCCO)c(SCCc2ccccc2)cc1Br
Show InChI InChI=1S/C17H19BrN2O4S2/c18-14-11-15(25-9-6-12-4-2-1-3-5-12)13(17(22)20-7-8-21)10-16(14)26(19,23)24/h1-5,10-11,21H,6-9H2,(H,20,22)(H2,19,23,24)
Reactome pathway
n/an/an/a 2n/an/an/an/an/a
Vilnius University
Curated by ChEMBL
Assay Description
Binding affinity to recombinant human carbonic anhydrase 5a expressed in Escherichia coli expression system assessed as kinetic dissociation constant...
Eur J Med Chem 185: (2020)
Article DOI: 10.1016/j.ejmech.2019.111825
Carbonic anhydrase 2
(Homo sapiens (Human))
BDBM50504930
(CHEMBL4515586)
Show SMILES NS(=O)(=O)c1cc(C(=O)NCCO)c(SCCc2ccccc2)cc1Br
Show InChI InChI=1S/C17H19BrN2O4S2/c18-14-11-15(25-9-6-12-4-2-1-3-5-12)13(17(22)20-7-8-21)10-16(14)26(19,23)24/h1-5,10-11,21H,6-9H2,(H,20,22)(H2,19,23,24)
Reactome pathway
n/an/an/a 22n/an/an/an/an/a
Vilnius University
Curated by ChEMBL
Assay Description
Binding affinity to recombinant human carbonic anhydrase 2 expressed in Escherichia coli expression system assessed as observed dissociation constant...
Eur J Med Chem 185: (2020)
Article DOI: 10.1016/j.ejmech.2019.111825
Carbonic anhydrase V
(Homo sapiens (Human))
BDBM50504930
(CHEMBL4515586)
Show SMILES NS(=O)(=O)c1cc(C(=O)NCCO)c(SCCc2ccccc2)cc1Br
Show InChI InChI=1S/C17H19BrN2O4S2/c18-14-11-15(25-9-6-12-4-2-1-3-5-12)13(17(22)20-7-8-21)10-16(14)26(19,23)24/h1-5,10-11,21H,6-9H2,(H,20,22)(H2,19,23,24)
Reactome pathway
n/an/an/a 0.0300n/an/an/an/an/a
Vilnius University
Curated by ChEMBL
Assay Description
Binding affinity to recombinant human carbonic anhydrase 5b expressed in Escherichia coli expression system assessed as kinetic dissociation constant...
Eur J Med Chem 185: (2020)
Article DOI: 10.1016/j.ejmech.2019.111825
Carbonic anhydrase
(Homo sapiens (Human))
BDBM50504930
(CHEMBL4515586)
Show SMILES NS(=O)(=O)c1cc(C(=O)NCCO)c(SCCc2ccccc2)cc1Br
Show InChI InChI=1S/C17H19BrN2O4S2/c18-14-11-15(25-9-6-12-4-2-1-3-5-12)13(17(22)20-7-8-21)10-16(14)26(19,23)24/h1-5,10-11,21H,6-9H2,(H,20,22)(H2,19,23,24)
Reactome pathway
n/an/an/a 13n/an/an/an/an/a
Vilnius University
Curated by ChEMBL
Assay Description
Binding affinity to recombinant human carbonic anhydrase 14 expressed in Escherichia coli expression system assessed as observed dissociation constan...
Eur J Med Chem 185: (2020)
Article DOI: 10.1016/j.ejmech.2019.111825
Carbonic anhydrase
(Homo sapiens (Human))
BDBM50504930
(CHEMBL4515586)
Show SMILES NS(=O)(=O)c1cc(C(=O)NCCO)c(SCCc2ccccc2)cc1Br
Show InChI InChI=1S/C17H19BrN2O4S2/c18-14-11-15(25-9-6-12-4-2-1-3-5-12)13(17(22)20-7-8-21)10-16(14)26(19,23)24/h1-5,10-11,21H,6-9H2,(H,20,22)(H2,19,23,24)
Reactome pathway
n/an/an/a 170n/an/an/an/an/a
Vilnius University
Curated by ChEMBL
Assay Description
Binding affinity to recombinant human carbonic anhydrase 4 expressed in Escherichia coli expression system assessed as observed dissociation constant...
Eur J Med Chem 185: (2020)
Article DOI: 10.1016/j.ejmech.2019.111825
Carbonic anhydrase
(Homo sapiens (Human))
BDBM50504930
(CHEMBL4515586)
Show SMILES NS(=O)(=O)c1cc(C(=O)NCCO)c(SCCc2ccccc2)cc1Br
Show InChI InChI=1S/C17H19BrN2O4S2/c18-14-11-15(25-9-6-12-4-2-1-3-5-12)13(17(22)20-7-8-21)10-16(14)26(19,23)24/h1-5,10-11,21H,6-9H2,(H,20,22)(H2,19,23,24)
NCI pathway
Reactome pathway
n/an/an/a 23n/an/an/an/an/a
Vilnius University
Curated by ChEMBL
Assay Description
Binding affinity to recombinant human carbonic anhydrase 1 expressed in Escherichia coli expression system assessed as kinetic dissociation constant ...
Eur J Med Chem 185: (2020)
Article DOI: 10.1016/j.ejmech.2019.111825
Carbonic anhydrase
(Homo sapiens (Human))
BDBM50504930
(CHEMBL4515586)
Show SMILES NS(=O)(=O)c1cc(C(=O)NCCO)c(SCCc2ccccc2)cc1Br
Show InChI InChI=1S/C17H19BrN2O4S2/c18-14-11-15(25-9-6-12-4-2-1-3-5-12)13(17(22)20-7-8-21)10-16(14)26(19,23)24/h1-5,10-11,21H,6-9H2,(H,20,22)(H2,19,23,24)
Reactome pathway
n/an/an/a 0.0100n/an/an/an/an/a
Vilnius University
Curated by ChEMBL
Assay Description
Binding affinity to recombinant human carbonic anhydrase 7 expressed in Escherichia coli expression system assessed as kinetic dissociation constant ...
Eur J Med Chem 185: (2020)
Article DOI: 10.1016/j.ejmech.2019.111825
Carbonic anhydrase V
(Homo sapiens (Human))
BDBM50504930
(CHEMBL4515586)
Show SMILES NS(=O)(=O)c1cc(C(=O)NCCO)c(SCCc2ccccc2)cc1Br
Show InChI InChI=1S/C17H19BrN2O4S2/c18-14-11-15(25-9-6-12-4-2-1-3-5-12)13(17(22)20-7-8-21)10-16(14)26(19,23)24/h1-5,10-11,21H,6-9H2,(H,20,22)(H2,19,23,24)
Reactome pathway
n/an/an/a 11n/an/an/an/an/a
Vilnius University
Curated by ChEMBL
Assay Description
Binding affinity to recombinant human carbonic anhydrase 5b expressed in Escherichia coli expression system assessed as observed dissociation constan...
Eur J Med Chem 185: (2020)
Article DOI: 10.1016/j.ejmech.2019.111825
Carbonic anhydrase
(Homo sapiens (Human))
BDBM50504930
(CHEMBL4515586)
Show SMILES NS(=O)(=O)c1cc(C(=O)NCCO)c(SCCc2ccccc2)cc1Br
Show InChI InChI=1S/C17H19BrN2O4S2/c18-14-11-15(25-9-6-12-4-2-1-3-5-12)13(17(22)20-7-8-21)10-16(14)26(19,23)24/h1-5,10-11,21H,6-9H2,(H,20,22)(H2,19,23,24)
n/an/an/a 0.100n/an/an/an/an/a
Vilnius University
Curated by ChEMBL
Assay Description
Binding affinity to recombinant human carbonic anhydrase 13 expressed in Escherichia coli expression system assessed as kinetic dissociation constant...
Eur J Med Chem 185: (2020)
Article DOI: 10.1016/j.ejmech.2019.111825
Carbonic anhydrase 2
(Homo sapiens (Human))
BDBM50504930
(CHEMBL4515586)
Show SMILES NS(=O)(=O)c1cc(C(=O)NCCO)c(SCCc2ccccc2)cc1Br
Show InChI InChI=1S/C17H19BrN2O4S2/c18-14-11-15(25-9-6-12-4-2-1-3-5-12)13(17(22)20-7-8-21)10-16(14)26(19,23)24/h1-5,10-11,21H,6-9H2,(H,20,22)(H2,19,23,24)
Reactome pathway
n/an/an/a 0.0600n/an/an/an/an/a
Vilnius University
Curated by ChEMBL
Assay Description
Binding affinity to recombinant human carbonic anhydrase 2 expressed in Escherichia coli expression system assessed as kinetic dissociation constant ...
Eur J Med Chem 185: (2020)
Article DOI: 10.1016/j.ejmech.2019.111825
Carbonic anhydrase
(Homo sapiens (Human))
BDBM50504930
(CHEMBL4515586)
Show SMILES NS(=O)(=O)c1cc(C(=O)NCCO)c(SCCc2ccccc2)cc1Br
Show InChI InChI=1S/C17H19BrN2O4S2/c18-14-11-15(25-9-6-12-4-2-1-3-5-12)13(17(22)20-7-8-21)10-16(14)26(19,23)24/h1-5,10-11,21H,6-9H2,(H,20,22)(H2,19,23,24)
Reactome pathway
n/an/an/a 5.60n/an/an/an/an/a
Vilnius University
Curated by ChEMBL
Assay Description
Binding affinity to recombinant human carbonic anhydrase 7 expressed in Escherichia coli expression system assessed as observed dissociation constant...
Eur J Med Chem 185: (2020)
Article DOI: 10.1016/j.ejmech.2019.111825
Carbonic anhydrases; II & IX
(Homo sapiens (Human))
BDBM50504930
(CHEMBL4515586)
Show SMILES NS(=O)(=O)c1cc(C(=O)NCCO)c(SCCc2ccccc2)cc1Br
Show InChI InChI=1S/C17H19BrN2O4S2/c18-14-11-15(25-9-6-12-4-2-1-3-5-12)13(17(22)20-7-8-21)10-16(14)26(19,23)24/h1-5,10-11,21H,6-9H2,(H,20,22)(H2,19,23,24)
NCI pathway
Reactome pathway
n/an/an/a 4.60n/an/an/an/an/a
Vilnius University
Curated by ChEMBL
Assay Description
Binding affinity to recombinant human carbonic anhydrase 9 expressed in mammalian cell expression system assessed as observed dissociation constant f...
Eur J Med Chem 185: (2020)
Article DOI: 10.1016/j.ejmech.2019.111825
Carbonic anhydrase
(Homo sapiens (Human))
BDBM50504930
(CHEMBL4515586)
Show SMILES NS(=O)(=O)c1cc(C(=O)NCCO)c(SCCc2ccccc2)cc1Br
Show InChI InChI=1S/C17H19BrN2O4S2/c18-14-11-15(25-9-6-12-4-2-1-3-5-12)13(17(22)20-7-8-21)10-16(14)26(19,23)24/h1-5,10-11,21H,6-9H2,(H,20,22)(H2,19,23,24)
Reactome pathway
n/an/an/a 4.00E+4n/an/an/an/an/a
Vilnius University
Curated by ChEMBL
Assay Description
Binding affinity to recombinant human carbonic anhydrase 3 expressed in Escherichia coli expression system assessed as observed dissociation constant...
Eur J Med Chem 185: (2020)
Article DOI: 10.1016/j.ejmech.2019.111825
Carbonic anhydrase V
(Homo sapiens (Human))
BDBM50504930
(CHEMBL4515586)
Show SMILES NS(=O)(=O)c1cc(C(=O)NCCO)c(SCCc2ccccc2)cc1Br
Show InChI InChI=1S/C17H19BrN2O4S2/c18-14-11-15(25-9-6-12-4-2-1-3-5-12)13(17(22)20-7-8-21)10-16(14)26(19,23)24/h1-5,10-11,21H,6-9H2,(H,20,22)(H2,19,23,24)
Reactome pathway
n/an/an/a 480n/an/an/an/an/a
Vilnius University
Curated by ChEMBL
Assay Description
Binding affinity to recombinant human carbonic anhydrase 5a expressed in Escherichia coli expression system assessed as observed dissociation constan...
Eur J Med Chem 185: (2020)
Article DOI: 10.1016/j.ejmech.2019.111825
Carbonic anhydrase
(Homo sapiens (Human))
BDBM50504930
(CHEMBL4515586)
Show SMILES NS(=O)(=O)c1cc(C(=O)NCCO)c(SCCc2ccccc2)cc1Br
Show InChI InChI=1S/C17H19BrN2O4S2/c18-14-11-15(25-9-6-12-4-2-1-3-5-12)13(17(22)20-7-8-21)10-16(14)26(19,23)24/h1-5,10-11,21H,6-9H2,(H,20,22)(H2,19,23,24)
Reactome pathway
n/an/an/a 0.0300n/an/an/an/an/a
Vilnius University
Curated by ChEMBL
Assay Description
Binding affinity to recombinant human carbonic anhydrase 12 expressed in Escherichia coli expression system assessed as kinetic dissociation constant...
Eur J Med Chem 185: (2020)
Article DOI: 10.1016/j.ejmech.2019.111825
Carbonic anhydrase
(Homo sapiens (Human))
BDBM50504930
(CHEMBL4515586)
Show SMILES NS(=O)(=O)c1cc(C(=O)NCCO)c(SCCc2ccccc2)cc1Br
Show InChI InChI=1S/C17H19BrN2O4S2/c18-14-11-15(25-9-6-12-4-2-1-3-5-12)13(17(22)20-7-8-21)10-16(14)26(19,23)24/h1-5,10-11,21H,6-9H2,(H,20,22)(H2,19,23,24)
Reactome pathway
n/an/an/a 0.0300n/an/an/an/an/a
Vilnius University
Curated by ChEMBL
Assay Description
Binding affinity to recombinant human carbonic anhydrase 14 expressed in Escherichia coli expression system assessed as kinetic dissociation constant...
Eur J Med Chem 185: (2020)
Article DOI: 10.1016/j.ejmech.2019.111825
Carbonic anhydrases; II & IX
(Homo sapiens (Human))
BDBM50504930
(CHEMBL4515586)
Show SMILES NS(=O)(=O)c1cc(C(=O)NCCO)c(SCCc2ccccc2)cc1Br
Show InChI InChI=1S/C17H19BrN2O4S2/c18-14-11-15(25-9-6-12-4-2-1-3-5-12)13(17(22)20-7-8-21)10-16(14)26(19,23)24/h1-5,10-11,21H,6-9H2,(H,20,22)(H2,19,23,24)
NCI pathway
Reactome pathway
n/an/an/a 0.00900n/an/an/an/an/a
Vilnius University
Curated by ChEMBL
Assay Description
Binding affinity to recombinant human carbonic anhydrase 9 expressed in mammalian cell expression system assessed as kinetic dissociation constant fl...
Eur J Med Chem 185: (2020)
Article DOI: 10.1016/j.ejmech.2019.111825