null
SMILES: NS(=O)(=O)c1cc(C(=O)NC2CCCCC2)c(SCc2ccccc2)cc1Cl
InChI Key: InChIKey=ZUCBUUIASYMKCB-UHFFFAOYSA-N
Activity Spreadsheet -- Enzyme Inhibition Constant Data from BindingDB
Found 23 hits for monomerid = 50504935
Trg + Lig
Ki
nM
ΔG°
kcal/mole
IC50
nM
Kd
nM
EC50/IC50
nM
koff
s-1
kon
M-1s-1
pHTemp
°C
Carbonic anhydrase 4
(Homo sapiens (Human))
BDBM50504935
(CHEMBL4451503)
Show SMILES NS(=O)(=O)c1cc(C(=O)NC2CCCCC2)c(SCc2ccccc2)cc1Cl
Show InChI InChI=1S/C20H23ClN2O3S2/c21-17-12-18(27-13-14-7-3-1-4-8-14)16(11-19(17)28(22,25)26)20(24)23-15-9-5-2-6-10-15/h1,3-4,7-8,11-12,15H,2,5-6,9-10,13H2,(H,23,24)(H2,22,25,26)
Reactome pathway
n/an/an/a 0.310n/an/an/an/an/a
Vilnius University
Curated by ChEMBL
Assay Description
Binding affinity to recombinant human carbonic anhydrase 4 expressed in Escherichia coli expression system assessed as kinetic dissociation constant ...
Eur J Med Chem 185: (2020)
Article DOI: 10.1016/j.ejmech.2019.111825
Carbonic anhydrase 14
(Homo sapiens (Human))
BDBM50504935
(CHEMBL4451503)
Show SMILES NS(=O)(=O)c1cc(C(=O)NC2CCCCC2)c(SCc2ccccc2)cc1Cl
Show InChI InChI=1S/C20H23ClN2O3S2/c21-17-12-18(27-13-14-7-3-1-4-8-14)16(11-19(17)28(22,25)26)20(24)23-15-9-5-2-6-10-15/h1,3-4,7-8,11-12,15H,2,5-6,9-10,13H2,(H,23,24)(H2,22,25,26)
Reactome pathway
n/an/an/a 0.0300n/an/an/an/an/a
Vilnius University
Curated by ChEMBL
Assay Description
Binding affinity to recombinant human carbonic anhydrase 14 expressed in Escherichia coli expression system assessed as kinetic dissociation constant...
Eur J Med Chem 185: (2020)
Article DOI: 10.1016/j.ejmech.2019.111825
Carbonic anhydrase 12
(Homo sapiens (Human))
BDBM50504935
(CHEMBL4451503)
Show SMILES NS(=O)(=O)c1cc(C(=O)NC2CCCCC2)c(SCc2ccccc2)cc1Cl
Show InChI InChI=1S/C20H23ClN2O3S2/c21-17-12-18(27-13-14-7-3-1-4-8-14)16(11-19(17)28(22,25)26)20(24)23-15-9-5-2-6-10-15/h1,3-4,7-8,11-12,15H,2,5-6,9-10,13H2,(H,23,24)(H2,22,25,26)
Reactome pathway
n/an/an/a 83n/an/an/an/an/a
Vilnius University
Curated by ChEMBL
Assay Description
Binding affinity to recombinant human carbonic anhydrase 12 expressed in Escherichia coli expression system assessed as observed dissociation constan...
Eur J Med Chem 185: (2020)
Article DOI: 10.1016/j.ejmech.2019.111825
Carbonic anhydrase 7
(Homo sapiens (Human))
BDBM50504935
(CHEMBL4451503)
Show SMILES NS(=O)(=O)c1cc(C(=O)NC2CCCCC2)c(SCc2ccccc2)cc1Cl
Show InChI InChI=1S/C20H23ClN2O3S2/c21-17-12-18(27-13-14-7-3-1-4-8-14)16(11-19(17)28(22,25)26)20(24)23-15-9-5-2-6-10-15/h1,3-4,7-8,11-12,15H,2,5-6,9-10,13H2,(H,23,24)(H2,22,25,26)
Reactome pathway
n/an/an/a 11n/an/an/an/an/a
Vilnius University
Curated by ChEMBL
Assay Description
Binding affinity to recombinant human carbonic anhydrase 7 expressed in Escherichia coli expression system assessed as observed dissociation constant...
Eur J Med Chem 185: (2020)
Article DOI: 10.1016/j.ejmech.2019.111825
Carbonic anhydrase 13
(Homo sapiens (Human))
BDBM50504935
(CHEMBL4451503)
Show SMILES NS(=O)(=O)c1cc(C(=O)NC2CCCCC2)c(SCc2ccccc2)cc1Cl
Show InChI InChI=1S/C20H23ClN2O3S2/c21-17-12-18(27-13-14-7-3-1-4-8-14)16(11-19(17)28(22,25)26)20(24)23-15-9-5-2-6-10-15/h1,3-4,7-8,11-12,15H,2,5-6,9-10,13H2,(H,23,24)(H2,22,25,26)
n/an/an/a 110n/an/an/an/an/a
Vilnius University
Curated by ChEMBL
Assay Description
Binding affinity to recombinant human carbonic anhydrase 13 expressed in Escherichia coli expression system assessed as observed dissociation constan...
Eur J Med Chem 185: (2020)
Article DOI: 10.1016/j.ejmech.2019.111825
Carbonic anhydrase 5A, mitochondrial
(Homo sapiens (Human))
BDBM50504935
(CHEMBL4451503)
Show SMILES NS(=O)(=O)c1cc(C(=O)NC2CCCCC2)c(SCc2ccccc2)cc1Cl
Show InChI InChI=1S/C20H23ClN2O3S2/c21-17-12-18(27-13-14-7-3-1-4-8-14)16(11-19(17)28(22,25)26)20(24)23-15-9-5-2-6-10-15/h1,3-4,7-8,11-12,15H,2,5-6,9-10,13H2,(H,23,24)(H2,22,25,26)
Reactome pathway
n/an/an/a 0.75n/an/an/an/an/a
Vilnius University
Curated by ChEMBL
Assay Description
Binding affinity to recombinant human carbonic anhydrase 5a expressed in Escherichia coli expression system assessed as kinetic dissociation constant...
Eur J Med Chem 185: (2020)
Article DOI: 10.1016/j.ejmech.2019.111825
Carbonic anhydrase 2
(Homo sapiens (Human))
BDBM50504935
(CHEMBL4451503)
Show SMILES NS(=O)(=O)c1cc(C(=O)NC2CCCCC2)c(SCc2ccccc2)cc1Cl
Show InChI InChI=1S/C20H23ClN2O3S2/c21-17-12-18(27-13-14-7-3-1-4-8-14)16(11-19(17)28(22,25)26)20(24)23-15-9-5-2-6-10-15/h1,3-4,7-8,11-12,15H,2,5-6,9-10,13H2,(H,23,24)(H2,22,25,26)
Reactome pathway
n/an/an/a 59n/an/an/an/an/a
Vilnius University
Curated by ChEMBL
Assay Description
Binding affinity to recombinant human carbonic anhydrase 2 expressed in Escherichia coli expression system assessed as observed dissociation constant...
Eur J Med Chem 185: (2020)
Article DOI: 10.1016/j.ejmech.2019.111825
Carbonic anhydrase 14
(Homo sapiens (Human))
BDBM50504935
(CHEMBL4451503)
Show SMILES NS(=O)(=O)c1cc(C(=O)NC2CCCCC2)c(SCc2ccccc2)cc1Cl
Show InChI InChI=1S/C20H23ClN2O3S2/c21-17-12-18(27-13-14-7-3-1-4-8-14)16(11-19(17)28(22,25)26)20(24)23-15-9-5-2-6-10-15/h1,3-4,7-8,11-12,15H,2,5-6,9-10,13H2,(H,23,24)(H2,22,25,26)
Reactome pathway
n/an/an/a 13n/an/an/an/an/a
Vilnius University
Curated by ChEMBL
Assay Description
Binding affinity to recombinant human carbonic anhydrase 14 expressed in Escherichia coli expression system assessed as observed dissociation constan...
Eur J Med Chem 185: (2020)
Article DOI: 10.1016/j.ejmech.2019.111825
Carbonic anhydrase 6
(Homo sapiens (Human))
BDBM50504935
(CHEMBL4451503)
Show SMILES NS(=O)(=O)c1cc(C(=O)NC2CCCCC2)c(SCc2ccccc2)cc1Cl
Show InChI InChI=1S/C20H23ClN2O3S2/c21-17-12-18(27-13-14-7-3-1-4-8-14)16(11-19(17)28(22,25)26)20(24)23-15-9-5-2-6-10-15/h1,3-4,7-8,11-12,15H,2,5-6,9-10,13H2,(H,23,24)(H2,22,25,26)
n/an/an/a 1.40n/an/an/an/an/a
Vilnius University
Curated by ChEMBL
Assay Description
Binding affinity to recombinant human carbonic anhydrase 6 expressed in Escherichia coli expression system assessed as kinetic dissociation constant ...
Eur J Med Chem 185: (2020)
Article DOI: 10.1016/j.ejmech.2019.111825
Carbonic anhydrase 4
(Homo sapiens (Human))
BDBM50504935
(CHEMBL4451503)
Show SMILES NS(=O)(=O)c1cc(C(=O)NC2CCCCC2)c(SCc2ccccc2)cc1Cl
Show InChI InChI=1S/C20H23ClN2O3S2/c21-17-12-18(27-13-14-7-3-1-4-8-14)16(11-19(17)28(22,25)26)20(24)23-15-9-5-2-6-10-15/h1,3-4,7-8,11-12,15H,2,5-6,9-10,13H2,(H,23,24)(H2,22,25,26)
Reactome pathway
n/an/an/a 180n/an/an/an/an/a
Vilnius University
Curated by ChEMBL
Assay Description
Binding affinity to recombinant human carbonic anhydrase 4 expressed in Escherichia coli expression system assessed as observed dissociation constant...
Eur J Med Chem 185: (2020)
Article DOI: 10.1016/j.ejmech.2019.111825
Carbonic anhydrase 1
(Homo sapiens (Human))
BDBM50504935
(CHEMBL4451503)
Show SMILES NS(=O)(=O)c1cc(C(=O)NC2CCCCC2)c(SCc2ccccc2)cc1Cl
Show InChI InChI=1S/C20H23ClN2O3S2/c21-17-12-18(27-13-14-7-3-1-4-8-14)16(11-19(17)28(22,25)26)20(24)23-15-9-5-2-6-10-15/h1,3-4,7-8,11-12,15H,2,5-6,9-10,13H2,(H,23,24)(H2,22,25,26)
NCI pathway
Reactome pathway
n/an/an/a 11n/an/an/an/an/a
Vilnius University
Curated by ChEMBL
Assay Description
Binding affinity to recombinant human carbonic anhydrase 1 expressed in Escherichia coli expression system assessed as kinetic dissociation constant ...
Eur J Med Chem 185: (2020)
Article DOI: 10.1016/j.ejmech.2019.111825
Carbonic anhydrase 5A, mitochondrial
(Homo sapiens (Human))
BDBM50504935
(CHEMBL4451503)
Show SMILES NS(=O)(=O)c1cc(C(=O)NC2CCCCC2)c(SCc2ccccc2)cc1Cl
Show InChI InChI=1S/C20H23ClN2O3S2/c21-17-12-18(27-13-14-7-3-1-4-8-14)16(11-19(17)28(22,25)26)20(24)23-15-9-5-2-6-10-15/h1,3-4,7-8,11-12,15H,2,5-6,9-10,13H2,(H,23,24)(H2,22,25,26)
Reactome pathway
n/an/an/a 180n/an/an/an/an/a
Vilnius University
Curated by ChEMBL
Assay Description
Binding affinity to recombinant human carbonic anhydrase 5a expressed in Escherichia coli expression system assessed as observed dissociation constan...
Eur J Med Chem 185: (2020)
Article DOI: 10.1016/j.ejmech.2019.111825
Carbonic anhydrase 2
(Homo sapiens (Human))
BDBM50504935
(CHEMBL4451503)
Show SMILES NS(=O)(=O)c1cc(C(=O)NC2CCCCC2)c(SCc2ccccc2)cc1Cl
Show InChI InChI=1S/C20H23ClN2O3S2/c21-17-12-18(27-13-14-7-3-1-4-8-14)16(11-19(17)28(22,25)26)20(24)23-15-9-5-2-6-10-15/h1,3-4,7-8,11-12,15H,2,5-6,9-10,13H2,(H,23,24)(H2,22,25,26)
Reactome pathway
n/an/an/a 0.170n/an/an/an/an/a
Vilnius University
Curated by ChEMBL
Assay Description
Binding affinity to recombinant human carbonic anhydrase 2 expressed in Escherichia coli expression system assessed as kinetic dissociation constant ...
Eur J Med Chem 185: (2020)
Article DOI: 10.1016/j.ejmech.2019.111825
Carbonic anhydrase 5B, mitochondrial
(Homo sapiens (Human))
BDBM50504935
(CHEMBL4451503)
Show SMILES NS(=O)(=O)c1cc(C(=O)NC2CCCCC2)c(SCc2ccccc2)cc1Cl
Show InChI InChI=1S/C20H23ClN2O3S2/c21-17-12-18(27-13-14-7-3-1-4-8-14)16(11-19(17)28(22,25)26)20(24)23-15-9-5-2-6-10-15/h1,3-4,7-8,11-12,15H,2,5-6,9-10,13H2,(H,23,24)(H2,22,25,26)
Reactome pathway
n/an/an/a 5n/an/an/an/an/a
Vilnius University
Curated by ChEMBL
Assay Description
Binding affinity to recombinant human carbonic anhydrase 5b expressed in Escherichia coli expression system assessed as observed dissociation constan...
Eur J Med Chem 185: (2020)
Article DOI: 10.1016/j.ejmech.2019.111825
Carbonic anhydrase 13
(Homo sapiens (Human))
BDBM50504935
(CHEMBL4451503)
Show SMILES NS(=O)(=O)c1cc(C(=O)NC2CCCCC2)c(SCc2ccccc2)cc1Cl
Show InChI InChI=1S/C20H23ClN2O3S2/c21-17-12-18(27-13-14-7-3-1-4-8-14)16(11-19(17)28(22,25)26)20(24)23-15-9-5-2-6-10-15/h1,3-4,7-8,11-12,15H,2,5-6,9-10,13H2,(H,23,24)(H2,22,25,26)
n/an/an/a 0.630n/an/an/an/an/a
Vilnius University
Curated by ChEMBL
Assay Description
Binding affinity to recombinant human carbonic anhydrase 13 expressed in Escherichia coli expression system assessed as kinetic dissociation constant...
Eur J Med Chem 185: (2020)
Article DOI: 10.1016/j.ejmech.2019.111825
Carbonic anhydrase 7
(Homo sapiens (Human))
BDBM50504935
(CHEMBL4451503)
Show SMILES NS(=O)(=O)c1cc(C(=O)NC2CCCCC2)c(SCc2ccccc2)cc1Cl
Show InChI InChI=1S/C20H23ClN2O3S2/c21-17-12-18(27-13-14-7-3-1-4-8-14)16(11-19(17)28(22,25)26)20(24)23-15-9-5-2-6-10-15/h1,3-4,7-8,11-12,15H,2,5-6,9-10,13H2,(H,23,24)(H2,22,25,26)
Reactome pathway
n/an/an/a 0.0300n/an/an/an/an/a
Vilnius University
Curated by ChEMBL
Assay Description
Binding affinity to recombinant human carbonic anhydrase 7 expressed in Escherichia coli expression system assessed as kinetic dissociation constant ...
Eur J Med Chem 185: (2020)
Article DOI: 10.1016/j.ejmech.2019.111825
Carbonic anhydrase 9
(Homo sapiens (Human))
BDBM50504935
(CHEMBL4451503)
Show SMILES NS(=O)(=O)c1cc(C(=O)NC2CCCCC2)c(SCc2ccccc2)cc1Cl
Show InChI InChI=1S/C20H23ClN2O3S2/c21-17-12-18(27-13-14-7-3-1-4-8-14)16(11-19(17)28(22,25)26)20(24)23-15-9-5-2-6-10-15/h1,3-4,7-8,11-12,15H,2,5-6,9-10,13H2,(H,23,24)(H2,22,25,26)
NCI pathway
Reactome pathway
n/an/an/a 0.0600n/an/an/an/an/a
Vilnius University
Curated by ChEMBL
Assay Description
Binding affinity to recombinant human carbonic anhydrase 9 expressed in mammalian cell expression system assessed as kinetic dissociation constant fl...
Eur J Med Chem 185: (2020)
Article DOI: 10.1016/j.ejmech.2019.111825
Carbonic anhydrase 1
(Homo sapiens (Human))
BDBM50504935
(CHEMBL4451503)
Show SMILES NS(=O)(=O)c1cc(C(=O)NC2CCCCC2)c(SCc2ccccc2)cc1Cl
Show InChI InChI=1S/C20H23ClN2O3S2/c21-17-12-18(27-13-14-7-3-1-4-8-14)16(11-19(17)28(22,25)26)20(24)23-15-9-5-2-6-10-15/h1,3-4,7-8,11-12,15H,2,5-6,9-10,13H2,(H,23,24)(H2,22,25,26)
NCI pathway
Reactome pathway
n/an/an/a 1.90E+3n/an/an/an/an/a
Vilnius University
Curated by ChEMBL
Assay Description
Binding affinity to recombinant human carbonic anhydrase 1 expressed in Escherichia coli expression system assessed as observed dissociation constant...
Eur J Med Chem 185: (2020)
Article DOI: 10.1016/j.ejmech.2019.111825
Carbonic anhydrase 3
(Homo sapiens (Human))
BDBM50504935
(CHEMBL4451503)
Show SMILES NS(=O)(=O)c1cc(C(=O)NC2CCCCC2)c(SCc2ccccc2)cc1Cl
Show InChI InChI=1S/C20H23ClN2O3S2/c21-17-12-18(27-13-14-7-3-1-4-8-14)16(11-19(17)28(22,25)26)20(24)23-15-9-5-2-6-10-15/h1,3-4,7-8,11-12,15H,2,5-6,9-10,13H2,(H,23,24)(H2,22,25,26)
Reactome pathway
n/an/an/a>2.00E+5n/an/an/an/an/a
Vilnius University
Curated by ChEMBL
Assay Description
Binding affinity to recombinant human carbonic anhydrase 3 expressed in Escherichia coli expression system assessed as kinetic dissociation constant ...
Eur J Med Chem 185: (2020)
Article DOI: 10.1016/j.ejmech.2019.111825
Carbonic anhydrase 5B, mitochondrial
(Homo sapiens (Human))
BDBM50504935
(CHEMBL4451503)
Show SMILES NS(=O)(=O)c1cc(C(=O)NC2CCCCC2)c(SCc2ccccc2)cc1Cl
Show InChI InChI=1S/C20H23ClN2O3S2/c21-17-12-18(27-13-14-7-3-1-4-8-14)16(11-19(17)28(22,25)26)20(24)23-15-9-5-2-6-10-15/h1,3-4,7-8,11-12,15H,2,5-6,9-10,13H2,(H,23,24)(H2,22,25,26)
Reactome pathway
n/an/an/a 0.0200n/an/an/an/an/a
Vilnius University
Curated by ChEMBL
Assay Description
Binding affinity to recombinant human carbonic anhydrase 5b expressed in Escherichia coli expression system assessed as kinetic dissociation constant...
Eur J Med Chem 185: (2020)
Article DOI: 10.1016/j.ejmech.2019.111825
Carbonic anhydrase 9
(Homo sapiens (Human))
BDBM50504935
(CHEMBL4451503)
Show SMILES NS(=O)(=O)c1cc(C(=O)NC2CCCCC2)c(SCc2ccccc2)cc1Cl
Show InChI InChI=1S/C20H23ClN2O3S2/c21-17-12-18(27-13-14-7-3-1-4-8-14)16(11-19(17)28(22,25)26)20(24)23-15-9-5-2-6-10-15/h1,3-4,7-8,11-12,15H,2,5-6,9-10,13H2,(H,23,24)(H2,22,25,26)
NCI pathway
Reactome pathway
n/an/an/a 29n/an/an/an/an/a
Vilnius University
Curated by ChEMBL
Assay Description
Binding affinity to recombinant human carbonic anhydrase 9 expressed in mammalian cell expression system assessed as observed dissociation constant f...
Eur J Med Chem 185: (2020)
Article DOI: 10.1016/j.ejmech.2019.111825
Carbonic anhydrase 12
(Homo sapiens (Human))
BDBM50504935
(CHEMBL4451503)
Show SMILES NS(=O)(=O)c1cc(C(=O)NC2CCCCC2)c(SCc2ccccc2)cc1Cl
Show InChI InChI=1S/C20H23ClN2O3S2/c21-17-12-18(27-13-14-7-3-1-4-8-14)16(11-19(17)28(22,25)26)20(24)23-15-9-5-2-6-10-15/h1,3-4,7-8,11-12,15H,2,5-6,9-10,13H2,(H,23,24)(H2,22,25,26)
Reactome pathway
n/an/an/a 0.200n/an/an/an/an/a
Vilnius University
Curated by ChEMBL
Assay Description
Binding affinity to recombinant human carbonic anhydrase 12 expressed in Escherichia coli expression system assessed as kinetic dissociation constant...
Eur J Med Chem 185: (2020)
Article DOI: 10.1016/j.ejmech.2019.111825
Carbonic anhydrase 6
(Homo sapiens (Human))
BDBM50504935
(CHEMBL4451503)
Show SMILES NS(=O)(=O)c1cc(C(=O)NC2CCCCC2)c(SCc2ccccc2)cc1Cl
Show InChI InChI=1S/C20H23ClN2O3S2/c21-17-12-18(27-13-14-7-3-1-4-8-14)16(11-19(17)28(22,25)26)20(24)23-15-9-5-2-6-10-15/h1,3-4,7-8,11-12,15H,2,5-6,9-10,13H2,(H,23,24)(H2,22,25,26)
n/an/an/a 2.50E+3n/an/an/an/an/a
Vilnius University
Curated by ChEMBL
Assay Description
Binding affinity to recombinant human carbonic anhydrase 6 expressed in Escherichia coli expression system assessed as observed dissociation constant...
Eur J Med Chem 185: (2020)
Article DOI: 10.1016/j.ejmech.2019.111825