BDBM50505799 CHEMBL4573509
SMILES: COc1ccc(cc1)C1N(CCc2sccc12)C(=O)Nc1ccc(Cl)cc1
InChI Key: InChIKey=RSYWZXKRITYMAL-UHFFFAOYSA-N
Data: 1 IC50
Activity Spreadsheet -- Enzyme Inhibition Constant Data from BindingDB
Found 1 hit for monomerid = 50505799
Trg + Lig
Ki
nM
ΔG°
kcal/mole
IC50
nM
Kd
nM
EC50/IC50
nM
koff
s-1
kon
M-1s-1
pHTemp
°C
Lutropin-choriogonadotropic hormone receptor
(Homo sapiens (Human))
BDBM50505799
(CHEMBL4573509)
Show SMILES COc1ccc(cc1)C1N(CCc2sccc12)C(=O)Nc1ccc(Cl)cc1
Show InChI InChI=1S/C21H19ClN2O2S/c1-26-17-8-2-14(3-9-17)20-18-11-13-27-19(18)10-12-24(20)21(25)23-16-6-4-15(22)5-7-16/h2-9,11,13,20H,10,12H2,1H3,(H,23,25)
n/an/a 107n/an/an/an/an/an/a
Bayer AG
Curated by ChEMBL
Assay Description
Antagonist activity at human luteinizing hormone receptor assessed as reduction in agonist-induced cAMP production preincubated for 20 mins followed ...
J Med Chem 62: 10321-10341 (2019)
Article DOI: 10.1021/acs.jmedchem.9b01382