BDBM50509975 CHEMBL4453147
SMILES: Fc1cccc(Nc2ncc3CSc4ncccc4-c3n2)c1
InChI Key: InChIKey=VIQXTJNRJDTXQU-UHFFFAOYSA-N
Data: 1 IC50
Activity Spreadsheet -- Enzyme Inhibition Constant Data from BindingDB
Found 1 hit for monomerid = 50509975
Trg + Lig
Ki
nM
ΔG°
kcal/mole
IC50
nM
Kd
nM
EC50/IC50
nM
koff
s-1
kon
M-1s-1
pHTemp
°C
Vascular endothelial growth factor receptor 2
(Homo sapiens (Human))
BDBM50509975
(CHEMBL4453147)
Show SMILES Fc1cccc(Nc2ncc3CSc4ncccc4-c3n2)c1
Show InChI InChI=1S/C16H11FN4S/c17-11-3-1-4-12(7-11)20-16-19-8-10-9-22-15-13(14(10)21-16)5-2-6-18-15/h1-8H,9H2,(H,19,20,21)
NCI pathway
Reactome pathway
n/an/a 92n/an/an/an/an/an/a
Universit£ di Pisa
Curated by ChEMBL
Assay Description
Inhibition of recombinant human KDR incubated for 1 hr using Tyr1 substrate by fluorimetry based Z'-LYTE-Tyr1 Peptide assay
ACS Med Chem Lett 10: 457-462 (2019)
Article DOI: 10.1021/acsmedchemlett.8b00499