BDBM50511430 CHEMBL4455353
SMILES: Cc1cccc(c1C)-c1nc(NC(N)=O)cc2NCCCc12
InChI Key: InChIKey=JYARVOLQINDAAO-UHFFFAOYSA-N
Data: 1 IC50
Activity Spreadsheet -- Enzyme Inhibition Constant Data from BindingDB
Found 1 hit for monomerid = 50511430
Trg + Lig
Ki
nM
ΔG°
kcal/mole
IC50
nM
Kd
nM
EC50/IC50
nM
koff
s-1
kon
M-1s-1
pHTemp
°C
7,8-dihydro-8-oxoguanine triphosphatase
(Homo sapiens (Human))
BDBM50511430
(CHEMBL4455353)
Show SMILES Cc1cccc(c1C)-c1nc(NC(N)=O)cc2NCCCc12
Show InChI InChI=1S/C17H20N4O/c1-10-5-3-6-12(11(10)2)16-13-7-4-8-19-14(13)9-15(20-16)21-17(18)22/h3,5-6,9,19H,4,7-8H2,1-2H3,(H3,18,20,21,22)
n/an/a<0.0500n/an/an/an/an/an/a
Gilead Sciences, Inc.
Curated by ChEMBL
Assay Description
Inhibition of human recombinant human His-tagged MTH1 expressed in Escherichia coli BL21 (DE3) using 8-oxo-dGTP as substrate incubated for 15 mins fo...
ACS Med Chem Lett 11: 358-364 (2020)
Article DOI: 10.1021/acsmedchemlett.9b00420