BDBM50511432 CHEMBL4435945
SMILES: COC(=O)Nc1cc2NCCCc2c(n1)-c1cccc(C)c1C
InChI Key: InChIKey=AGJXLMPNEFXHGW-UHFFFAOYSA-N
Data: 1 IC50
Activity Spreadsheet -- Enzyme Inhibition Constant Data from BindingDB
Found 1 hit for monomerid = 50511432
Trg + Lig
Ki
nM
ΔG°
kcal/mole
IC50
nM
Kd
nM
EC50/IC50
nM
koff
s-1
kon
M-1s-1
pHTemp
°C
7,8-dihydro-8-oxoguanine triphosphatase
(Homo sapiens (Human))
BDBM50511432
(CHEMBL4435945)
Show SMILES COC(=O)Nc1cc2NCCCc2c(n1)-c1cccc(C)c1C
Show InChI InChI=1S/C18H21N3O2/c1-11-6-4-7-13(12(11)2)17-14-8-5-9-19-15(14)10-16(20-17)21-18(22)23-3/h4,6-7,10,19H,5,8-9H2,1-3H3,(H,20,21,22)
n/an/a 0.150n/an/an/an/an/an/a
Gilead Sciences, Inc.
Curated by ChEMBL
Assay Description
Inhibition of human recombinant human His-tagged MTH1 expressed in Escherichia coli BL21 (DE3) using 8-oxo-dGTP as substrate incubated for 15 mins fo...
ACS Med Chem Lett 11: 358-364 (2020)
Article DOI: 10.1021/acsmedchemlett.9b00420