BDBM50511449 CHEMBL4540488
SMILES: CNc1cc(nc(NC(C)=O)n1)-c1cccc(Cl)c1Cl
InChI Key: InChIKey=OPCPDLUNQUHMKH-UHFFFAOYSA-N
Data: 1 IC50
Activity Spreadsheet -- Enzyme Inhibition Constant Data from BindingDB
Found 1 hit for monomerid = 50511449
Trg + Lig
Ki
nM
ΔG°
kcal/mole
IC50
nM
Kd
nM
EC50/IC50
nM
koff
s-1
kon
M-1s-1
pHTemp
°C
7,8-dihydro-8-oxoguanine triphosphatase
(Homo sapiens (Human))
BDBM50511449
(CHEMBL4540488)
Show SMILES CNc1cc(nc(NC(C)=O)n1)-c1cccc(Cl)c1Cl
Show InChI InChI=1S/C13H12Cl2N4O/c1-7(20)17-13-18-10(6-11(16-2)19-13)8-4-3-5-9(14)12(8)15/h3-6H,1-2H3,(H2,16,17,18,19,20)
n/an/a 125n/an/an/an/an/an/a
Gilead Sciences, Inc.
Curated by ChEMBL
Assay Description
Inhibition of human recombinant human His-tagged MTH1 expressed in Escherichia coli BL21 (DE3) using 8-oxo-dGTP as substrate incubated for 15 mins fo...
ACS Med Chem Lett 11: 358-364 (2020)
Article DOI: 10.1021/acsmedchemlett.9b00420