BDBM50513346 CHEMBL4525269
SMILES: O=c1[nH]cnc2c(nccc12)-n1cc(cn1)C1CCN(CC2CCC2)CC1
InChI Key: InChIKey=FQYVJQRHNLIPIK-UHFFFAOYSA-N
Data: 2 KI  17 IC50  3 EC50
PDB links: 1 PDB ID matches this monomer.
Activity Spreadsheet -- Enzyme Inhibition Constant Data from BindingDB
Found 22 hits for monomerid = 50513346
Trg + Lig
Ki
nM
ΔG°
kcal/mole
IC50
nM
Kd
nM
EC50/IC50
nM
koff
s-1
kon
M-1s-1
pHTemp
°C
Lysine-specific demethylase 5B
(Homo sapiens (Human))
BDBM50513346
(CHEMBL4525269)
Show SMILES O=c1[nH]cnc2c(nccc12)-n1cc(cn1)C1CCN(CC2CCC2)CC1
Show InChI InChI=1S/C20H24N6O/c27-20-17-4-7-21-19(18(17)22-13-23-20)26-12-16(10-24-26)15-5-8-25(9-6-15)11-14-2-1-3-14/h4,7,10,12-15H,1-3,5-6,8-9,11H2,(H,22,23,27)
16n/an/an/an/an/an/an/an/a
Institute of Cancer Research
Curated by ChEMBL
Assay Description
Binding affinity to KDM5B (unknown origin)
Eur J Med Chem 177: 316-337 (2019)
Article DOI: 10.1016/j.ejmech.2019.05.041
3D
3D Structure (crystal)
Lysine-specific demethylase 4A
(Homo sapiens (Human))
BDBM50513346
(CHEMBL4525269)
Show SMILES O=c1[nH]cnc2c(nccc12)-n1cc(cn1)C1CCN(CC2CCC2)CC1
Show InChI InChI=1S/C20H24N6O/c27-20-17-4-7-21-19(18(17)22-13-23-20)26-12-16(10-24-26)15-5-8-25(9-6-15)11-14-2-1-3-14/h4,7,10,12-15H,1-3,5-6,8-9,11H2,(H,22,23,27)
26n/an/an/an/an/an/an/an/a
Institute of Cancer Research
Curated by ChEMBL
Assay Description
Binding affinity to KDM4A (unknown origin)
Eur J Med Chem 177: 316-337 (2019)
Article DOI: 10.1016/j.ejmech.2019.05.041
Lysine-specific demethylase 4B
(Homo sapiens (Human))
BDBM50513346
(CHEMBL4525269)
Show SMILES O=c1[nH]cnc2c(nccc12)-n1cc(cn1)C1CCN(CC2CCC2)CC1
Show InChI InChI=1S/C20H24N6O/c27-20-17-4-7-21-19(18(17)22-13-23-20)26-12-16(10-24-26)15-5-8-25(9-6-15)11-14-2-1-3-14/h4,7,10,12-15H,1-3,5-6,8-9,11H2,(H,22,23,27)
n/an/an/an/a 9.10E+3n/an/an/an/a
Institute of Cancer Research
Curated by ChEMBL
Assay Description
Binding affinity to recombinant human N-terminal KDM4B (1 to 348 residues) fused upstream with E31G-R71G-K105E/ePL-tagged C-terminal transfected in H...
Eur J Med Chem 177: 316-337 (2019)
Article DOI: 10.1016/j.ejmech.2019.05.041
Lysine-specific demethylase 4B
(Homo sapiens (Human))
BDBM50513346
(CHEMBL4525269)
Show SMILES O=c1[nH]cnc2c(nccc12)-n1cc(cn1)C1CCN(CC2CCC2)CC1
Show InChI InChI=1S/C20H24N6O/c27-20-17-4-7-21-19(18(17)22-13-23-20)26-12-16(10-24-26)15-5-8-25(9-6-15)11-14-2-1-3-14/h4,7,10,12-15H,1-3,5-6,8-9,11H2,(H,22,23,27)
n/an/a 265n/an/an/an/an/an/a
Institute of Cancer Research
Curated by ChEMBL
Assay Description
Inhibition of full length human KDM4B assessed as decrease in demethylation of substrate using peptide (ARTKQTARK(Me3)STGGKAPRKQLA-GGKbiotin) as subs...
Eur J Med Chem 177: 316-337 (2019)
Article DOI: 10.1016/j.ejmech.2019.05.041
Lysine-specific demethylase 4B
(Homo sapiens (Human))
BDBM50513346
(CHEMBL4525269)
Show SMILES O=c1[nH]cnc2c(nccc12)-n1cc(cn1)C1CCN(CC2CCC2)CC1
Show InChI InChI=1S/C20H24N6O/c27-20-17-4-7-21-19(18(17)22-13-23-20)26-12-16(10-24-26)15-5-8-25(9-6-15)11-14-2-1-3-14/h4,7,10,12-15H,1-3,5-6,8-9,11H2,(H,22,23,27)
n/an/a 477n/an/an/an/an/an/a
Institute of Cancer Research
Curated by ChEMBL
Assay Description
Inhibition of full length human KDM4B assessed as decrease in demethylation of substrate using peptide (ARTKQTARK(Me3)STGGKAPRKQLA-GGKbiotin) as subs...
Eur J Med Chem 177: 316-337 (2019)
Article DOI: 10.1016/j.ejmech.2019.05.041
Lysine-specific demethylase 4B
(Homo sapiens (Human))
BDBM50513346
(CHEMBL4525269)
Show SMILES O=c1[nH]cnc2c(nccc12)-n1cc(cn1)C1CCN(CC2CCC2)CC1
Show InChI InChI=1S/C20H24N6O/c27-20-17-4-7-21-19(18(17)22-13-23-20)26-12-16(10-24-26)15-5-8-25(9-6-15)11-14-2-1-3-14/h4,7,10,12-15H,1-3,5-6,8-9,11H2,(H,22,23,27)
n/an/a 1.11E+3n/an/an/an/an/an/a
Institute of Cancer Research
Curated by ChEMBL
Assay Description
Inhibition of full length human KDM4B assessed as decrease in demethylation of substrate using peptide (ARTKQTARK(Me3)STGGKAPRKQLA-GGKbiotin) as subs...
Eur J Med Chem 177: 316-337 (2019)
Article DOI: 10.1016/j.ejmech.2019.05.041
Lysine-specific demethylase 4B
(Homo sapiens (Human))
BDBM50513346
(CHEMBL4525269)
Show SMILES O=c1[nH]cnc2c(nccc12)-n1cc(cn1)C1CCN(CC2CCC2)CC1
Show InChI InChI=1S/C20H24N6O/c27-20-17-4-7-21-19(18(17)22-13-23-20)26-12-16(10-24-26)15-5-8-25(9-6-15)11-14-2-1-3-14/h4,7,10,12-15H,1-3,5-6,8-9,11H2,(H,22,23,27)
n/an/a 8.68E+3n/an/an/an/an/an/a
Institute of Cancer Research
Curated by ChEMBL
Assay Description
Inhibition of full length human KDM4B assessed as decrease in demethylation of substrate using peptide (ARTKQTARK(Me3)STGGKAPRKQLA-GGKbiotin) as subs...
Eur J Med Chem 177: 316-337 (2019)
Article DOI: 10.1016/j.ejmech.2019.05.041
Lysine-specific demethylase 4B
(Homo sapiens (Human))
BDBM50513346
(CHEMBL4525269)
Show SMILES O=c1[nH]cnc2c(nccc12)-n1cc(cn1)C1CCN(CC2CCC2)CC1
Show InChI InChI=1S/C20H24N6O/c27-20-17-4-7-21-19(18(17)22-13-23-20)26-12-16(10-24-26)15-5-8-25(9-6-15)11-14-2-1-3-14/h4,7,10,12-15H,1-3,5-6,8-9,11H2,(H,22,23,27)
n/an/a 40n/an/an/an/an/an/a
Institute of Cancer Research
Curated by ChEMBL
Assay Description
Inhibition of full length human KDM4B assessed as decrease in demethylation of substrate using peptide (ARTKQTARK(Me3)STGGKAPRKQLA-GGKbiotin) as subs...
Eur J Med Chem 177: 316-337 (2019)
Article DOI: 10.1016/j.ejmech.2019.05.041
Lysine-specific demethylase 5B
(Homo sapiens (Human))
BDBM50513346
(CHEMBL4525269)
Show SMILES O=c1[nH]cnc2c(nccc12)-n1cc(cn1)C1CCN(CC2CCC2)CC1
Show InChI InChI=1S/C20H24N6O/c27-20-17-4-7-21-19(18(17)22-13-23-20)26-12-16(10-24-26)15-5-8-25(9-6-15)11-14-2-1-3-14/h4,7,10,12-15H,1-3,5-6,8-9,11H2,(H,22,23,27)
n/an/a 134n/an/an/an/an/an/a
Institute of Cancer Research
Curated by ChEMBL
Assay Description
Inhibition of KDM5B (unknown origin) assessed as decrease in demethylation of substrate using peptide (H3(1-21)K4-Me3-GGKBiotin) as substrate and 2OG...
Eur J Med Chem 177: 316-337 (2019)
Article DOI: 10.1016/j.ejmech.2019.05.041
3D
3D Structure (crystal)
Lysine-specific demethylase 5C
(Homo sapiens (Human))
BDBM50513346
(CHEMBL4525269)
Show SMILES O=c1[nH]cnc2c(nccc12)-n1cc(cn1)C1CCN(CC2CCC2)CC1
Show InChI InChI=1S/C20H24N6O/c27-20-17-4-7-21-19(18(17)22-13-23-20)26-12-16(10-24-26)15-5-8-25(9-6-15)11-14-2-1-3-14/h4,7,10,12-15H,1-3,5-6,8-9,11H2,(H,22,23,27)
Reactome pathway
n/an/a 202n/an/an/an/an/an/a
Institute of Cancer Research
Curated by ChEMBL
Assay Description
Inhibition of KDM5C (unknown origin) assessed as decrease in demethylation of substrate using peptide (H3(1-21)K4-Me3-GGKBiotin) as substrate and 2OG...
Eur J Med Chem 177: 316-337 (2019)
Article DOI: 10.1016/j.ejmech.2019.05.041
Lysine-specific demethylase 4B
(Homo sapiens (Human))
BDBM50513346
(CHEMBL4525269)
Show SMILES O=c1[nH]cnc2c(nccc12)-n1cc(cn1)C1CCN(CC2CCC2)CC1
Show InChI InChI=1S/C20H24N6O/c27-20-17-4-7-21-19(18(17)22-13-23-20)26-12-16(10-24-26)15-5-8-25(9-6-15)11-14-2-1-3-14/h4,7,10,12-15H,1-3,5-6,8-9,11H2,(H,22,23,27)
n/an/a 66n/an/an/an/an/an/a
Institute of Cancer Research
Curated by ChEMBL
Assay Description
Inhibition of full length human KDM4B assessed as decrease in demethylation of substrate using peptide (ARTKQTARK(Me3)STGGKAPRKQLA-GGKbiotin) as subs...
Eur J Med Chem 177: 316-337 (2019)
Article DOI: 10.1016/j.ejmech.2019.05.041
Lysine-specific demethylase 4A
(Homo sapiens (Human))
BDBM50513346
(CHEMBL4525269)
Show SMILES O=c1[nH]cnc2c(nccc12)-n1cc(cn1)C1CCN(CC2CCC2)CC1
Show InChI InChI=1S/C20H24N6O/c27-20-17-4-7-21-19(18(17)22-13-23-20)26-12-16(10-24-26)15-5-8-25(9-6-15)11-14-2-1-3-14/h4,7,10,12-15H,1-3,5-6,8-9,11H2,(H,22,23,27)
n/an/a 559n/an/an/an/an/an/a
Institute of Cancer Research
Curated by ChEMBL
Assay Description
Inhibition of N-terminal His-tagged recombinant human KDM4A (1 to 359 residues) expressed in Escherichia coli assessed as decrease in demethylation o...
Eur J Med Chem 177: 316-337 (2019)
Article DOI: 10.1016/j.ejmech.2019.05.041
Lysine-specific demethylase 4B
(Homo sapiens (Human))
BDBM50513346
(CHEMBL4525269)
Show SMILES O=c1[nH]cnc2c(nccc12)-n1cc(cn1)C1CCN(CC2CCC2)CC1
Show InChI InChI=1S/C20H24N6O/c27-20-17-4-7-21-19(18(17)22-13-23-20)26-12-16(10-24-26)15-5-8-25(9-6-15)11-14-2-1-3-14/h4,7,10,12-15H,1-3,5-6,8-9,11H2,(H,22,23,27)
n/an/a 121n/an/an/an/an/an/a
Institute of Cancer Research
Curated by ChEMBL
Assay Description
Inhibition of full length human KDM4B assessed as decrease in demethylation of substrate using peptide (ARTKQTARK(Me3)STGGKAPRKQLA-GGKbiotin) as subs...
Eur J Med Chem 177: 316-337 (2019)
Article DOI: 10.1016/j.ejmech.2019.05.041
Homo sapiens lysine demethylase 2A (KDM2A)
(Homo sapiens (Human))
BDBM50513346
(CHEMBL4525269)
Show SMILES O=c1[nH]cnc2c(nccc12)-n1cc(cn1)C1CCN(CC2CCC2)CC1
Show InChI InChI=1S/C20H24N6O/c27-20-17-4-7-21-19(18(17)22-13-23-20)26-12-16(10-24-26)15-5-8-25(9-6-15)11-14-2-1-3-14/h4,7,10,12-15H,1-3,5-6,8-9,11H2,(H,22,23,27)
n/an/a 1.25E+4n/an/an/an/an/an/a
Institute of Cancer Research
Curated by ChEMBL
Assay Description
Inhibition of KDM2A (unknown origin) by Alphascreen assay
Eur J Med Chem 177: 316-337 (2019)
Article DOI: 10.1016/j.ejmech.2019.05.041
Lysine-specific demethylase 3A
(Homo sapiens (Human))
BDBM50513346
(CHEMBL4525269)
Show SMILES O=c1[nH]cnc2c(nccc12)-n1cc(cn1)C1CCN(CC2CCC2)CC1
Show InChI InChI=1S/C20H24N6O/c27-20-17-4-7-21-19(18(17)22-13-23-20)26-12-16(10-24-26)15-5-8-25(9-6-15)11-14-2-1-3-14/h4,7,10,12-15H,1-3,5-6,8-9,11H2,(H,22,23,27)
Reactome pathway
n/an/a 6.13E+3n/an/an/an/an/an/a
Institute of Cancer Research
Curated by ChEMBL
Assay Description
Inhibition of KDM3A (unknown origin) by Alphascreen assay
Eur J Med Chem 177: 316-337 (2019)
Article DOI: 10.1016/j.ejmech.2019.05.041
Lysine-specific demethylase 5B
(Homo sapiens (Human))
BDBM50513346
(CHEMBL4525269)
Show SMILES O=c1[nH]cnc2c(nccc12)-n1cc(cn1)C1CCN(CC2CCC2)CC1
Show InChI InChI=1S/C20H24N6O/c27-20-17-4-7-21-19(18(17)22-13-23-20)26-12-16(10-24-26)15-5-8-25(9-6-15)11-14-2-1-3-14/h4,7,10,12-15H,1-3,5-6,8-9,11H2,(H,22,23,27)
n/an/an/an/a 6.60E+3n/an/an/an/a
Institute of Cancer Research
Curated by ChEMBL
Assay Description
Binding affinity to recombinant human N-terminal KDM5B (26 to 772 residues) fused with ePL-tagged C-terminal transfected in HEK293T cells measured af...
Eur J Med Chem 177: 316-337 (2019)
Article DOI: 10.1016/j.ejmech.2019.05.041
3D
3D Structure (crystal)
Lysine-specific demethylase 4B
(Homo sapiens (Human))
BDBM50513346
(CHEMBL4525269)
Show SMILES O=c1[nH]cnc2c(nccc12)-n1cc(cn1)C1CCN(CC2CCC2)CC1
Show InChI InChI=1S/C20H24N6O/c27-20-17-4-7-21-19(18(17)22-13-23-20)26-12-16(10-24-26)15-5-8-25(9-6-15)11-14-2-1-3-14/h4,7,10,12-15H,1-3,5-6,8-9,11H2,(H,22,23,27)
n/an/a 564n/an/an/an/an/an/a
Institute of Cancer Research
Curated by ChEMBL
Assay Description
Inhibition of full length human KDM4B assessed as decrease in demethylation of substrate using peptide (ARTKQTARK(Me3)STGGKAPRKQLA-GGKbiotin) as subs...
Eur J Med Chem 177: 316-337 (2019)
Article DOI: 10.1016/j.ejmech.2019.05.041
Lysine-specific demethylase 4B
(Homo sapiens (Human))
BDBM50513346
(CHEMBL4525269)
Show SMILES O=c1[nH]cnc2c(nccc12)-n1cc(cn1)C1CCN(CC2CCC2)CC1
Show InChI InChI=1S/C20H24N6O/c27-20-17-4-7-21-19(18(17)22-13-23-20)26-12-16(10-24-26)15-5-8-25(9-6-15)11-14-2-1-3-14/h4,7,10,12-15H,1-3,5-6,8-9,11H2,(H,22,23,27)
n/an/a 2.44E+3n/an/an/an/an/an/a
Institute of Cancer Research
Curated by ChEMBL
Assay Description
Inhibition of full length human KDM4B assessed as decrease in demethylation of substrate using peptide (ARTKQTARK(Me3)STGGKAPRKQLA-GGKbiotin) as subs...
Eur J Med Chem 177: 316-337 (2019)
Article DOI: 10.1016/j.ejmech.2019.05.041
Lysine-specific demethylase 4B
(Homo sapiens (Human))
BDBM50513346
(CHEMBL4525269)
Show SMILES O=c1[nH]cnc2c(nccc12)-n1cc(cn1)C1CCN(CC2CCC2)CC1
Show InChI InChI=1S/C20H24N6O/c27-20-17-4-7-21-19(18(17)22-13-23-20)26-12-16(10-24-26)15-5-8-25(9-6-15)11-14-2-1-3-14/h4,7,10,12-15H,1-3,5-6,8-9,11H2,(H,22,23,27)
n/an/a 1.11E+4n/an/an/an/an/an/a
Institute of Cancer Research
Curated by ChEMBL
Assay Description
Inhibition of full length human KDM4B assessed as decrease in demethylation of substrate using peptide (ARTKQTARK(Me3)STGGKAPRKQLA-GGKbiotin) as subs...
Eur J Med Chem 177: 316-337 (2019)
Article DOI: 10.1016/j.ejmech.2019.05.041
Lysine-specific demethylase 5B
(Homo sapiens (Human))
BDBM50513346
(CHEMBL4525269)
Show SMILES O=c1[nH]cnc2c(nccc12)-n1cc(cn1)C1CCN(CC2CCC2)CC1
Show InChI InChI=1S/C20H24N6O/c27-20-17-4-7-21-19(18(17)22-13-23-20)26-12-16(10-24-26)15-5-8-25(9-6-15)11-14-2-1-3-14/h4,7,10,12-15H,1-3,5-6,8-9,11H2,(H,22,23,27)
n/an/an/an/a 2.64E+4n/an/an/an/a
Institute of Cancer Research
Curated by ChEMBL
Assay Description
Inhibition of full length human wild type KDM5B transfected in HeLa cells assessed as decrease in demethylation of H3K4Me3 measured after 24 hrs by c...
Eur J Med Chem 177: 316-337 (2019)
Article DOI: 10.1016/j.ejmech.2019.05.041
3D
3D Structure (crystal)
Lysine-specific demethylase 4B
(Homo sapiens (Human))
BDBM50513346
(CHEMBL4525269)
Show SMILES O=c1[nH]cnc2c(nccc12)-n1cc(cn1)C1CCN(CC2CCC2)CC1
Show InChI InChI=1S/C20H24N6O/c27-20-17-4-7-21-19(18(17)22-13-23-20)26-12-16(10-24-26)15-5-8-25(9-6-15)11-14-2-1-3-14/h4,7,10,12-15H,1-3,5-6,8-9,11H2,(H,22,23,27)
n/an/a 248n/an/an/an/an/an/a
Institute of Cancer Research
Curated by ChEMBL
Assay Description
Inhibition of N-terminal GST-tagged recombinant human KDM4B (1 to 500 residues) expressed in baculovirus infected Sf9 insect cells assessed as decrea...
Eur J Med Chem 177: 316-337 (2019)
Article DOI: 10.1016/j.ejmech.2019.05.041
Lysine-specific demethylase 4B
(Homo sapiens (Human))
BDBM50513346
(CHEMBL4525269)
Show SMILES O=c1[nH]cnc2c(nccc12)-n1cc(cn1)C1CCN(CC2CCC2)CC1
Show InChI InChI=1S/C20H24N6O/c27-20-17-4-7-21-19(18(17)22-13-23-20)26-12-16(10-24-26)15-5-8-25(9-6-15)11-14-2-1-3-14/h4,7,10,12-15H,1-3,5-6,8-9,11H2,(H,22,23,27)
n/an/a 4.21E+3n/an/an/an/an/an/a
Institute of Cancer Research
Curated by ChEMBL
Assay Description
Inhibition of full length human KDM4B assessed as decrease in demethylation of substrate using peptide (ARTKQTARK(Me3)STGGKAPRKQLA-GGKbiotin) as subs...
Eur J Med Chem 177: 316-337 (2019)
Article DOI: 10.1016/j.ejmech.2019.05.041