null
SMILES: O=c1[nH]cnc2c(nccc12)-n1cc(CCN2CCC(CC2)c2ccc(cc2)-c2cccnc2)cn1
InChI Key: InChIKey=JRDMCDIQZVMPPB-UHFFFAOYSA-N
PDB links: 1 PDB ID matches this monomer.
Activity Spreadsheet -- Enzyme Inhibition Constant Data from BindingDB
Found 4 hits for monomerid = 50513367
Trg + Lig
Ki
nM
ΔG°
kcal/mole
IC50
nM
Kd
nM
EC50/IC50
nM
koff
s-1
kon
M-1s-1
pHTemp
°C
Lysine-specific demethylase 4B
(Homo sapiens (Human))
BDBM50513367
(CHEMBL4559561)
Show SMILES O=c1[nH]cnc2c(nccc12)-n1cc(CCN2CCC(CC2)c2ccc(cc2)-c2cccnc2)cn1
Show InChI InChI=1S/C28H27N7O/c36-28-25-7-12-30-27(26(25)31-19-32-28)35-18-20(16-33-35)8-13-34-14-9-23(10-15-34)21-3-5-22(6-4-21)24-2-1-11-29-17-24/h1-7,11-12,16-19,23H,8-10,13-15H2,(H,31,32,36)
n/an/a 24n/an/an/an/an/an/a
Institute of Cancer Research
Curated by ChEMBL
Assay Description
Inhibition of N-terminal GST-tagged recombinant human KDM4B (1 to 500 residues) expressed in baculovirus infected Sf9 insect cells assessed as decrea...
Eur J Med Chem 177: 316-337 (2019)
Article DOI: 10.1016/j.ejmech.2019.05.041
Lysine-specific demethylase 4A
(Homo sapiens (Human))
BDBM50513367
(CHEMBL4559561)
Show SMILES O=c1[nH]cnc2c(nccc12)-n1cc(CCN2CCC(CC2)c2ccc(cc2)-c2cccnc2)cn1
Show InChI InChI=1S/C28H27N7O/c36-28-25-7-12-30-27(26(25)31-19-32-28)35-18-20(16-33-35)8-13-34-14-9-23(10-15-34)21-3-5-22(6-4-21)24-2-1-11-29-17-24/h1-7,11-12,16-19,23H,8-10,13-15H2,(H,31,32,36)
n/an/a 131n/an/an/an/an/an/a
Institute of Cancer Research
Curated by ChEMBL
Assay Description
Inhibition of N-terminal His-tagged recombinant human KDM4A (1 to 359 residues) expressed in Escherichia coli assessed as decrease in demethylation o...
Eur J Med Chem 177: 316-337 (2019)
Article DOI: 10.1016/j.ejmech.2019.05.041
3D
3D Structure (crystal)
Lysine-specific demethylase 5C
(Homo sapiens (Human))
BDBM50513367
(CHEMBL4559561)
Show SMILES O=c1[nH]cnc2c(nccc12)-n1cc(CCN2CCC(CC2)c2ccc(cc2)-c2cccnc2)cn1
Show InChI InChI=1S/C28H27N7O/c36-28-25-7-12-30-27(26(25)31-19-32-28)35-18-20(16-33-35)8-13-34-14-9-23(10-15-34)21-3-5-22(6-4-21)24-2-1-11-29-17-24/h1-7,11-12,16-19,23H,8-10,13-15H2,(H,31,32,36)
Reactome pathway
n/an/a 246n/an/an/an/an/an/a
Institute of Cancer Research
Curated by ChEMBL
Assay Description
Inhibition of KDM5C (unknown origin) assessed as decrease in demethylation of substrate using peptide (H3(1-21)K4-Me3-GGKBiotin) as substrate and 2OG...
Eur J Med Chem 177: 316-337 (2019)
Article DOI: 10.1016/j.ejmech.2019.05.041
Lysine-specific demethylase 5B
(Homo sapiens (Human))
BDBM50513367
(CHEMBL4559561)
Show SMILES O=c1[nH]cnc2c(nccc12)-n1cc(CCN2CCC(CC2)c2ccc(cc2)-c2cccnc2)cn1
Show InChI InChI=1S/C28H27N7O/c36-28-25-7-12-30-27(26(25)31-19-32-28)35-18-20(16-33-35)8-13-34-14-9-23(10-15-34)21-3-5-22(6-4-21)24-2-1-11-29-17-24/h1-7,11-12,16-19,23H,8-10,13-15H2,(H,31,32,36)
n/an/a 80n/an/an/an/an/an/a
Institute of Cancer Research
Curated by ChEMBL
Assay Description
Inhibition of KDM5B (unknown origin) assessed as decrease in demethylation of substrate using peptide (H3(1-21)K4-Me3-GGKBiotin) as substrate and 2OG...
Eur J Med Chem 177: 316-337 (2019)
Article DOI: 10.1016/j.ejmech.2019.05.041