BDBM50514282 CHEMBL4543096
SMILES: Cc1cc(F)cc(C)c1C(=O)c1sc2cc(O)ccc2c1Oc1ccc(OCCN2CC(CF)C2)cc1
InChI Key: InChIKey=XOIXKPAMOCOEMO-UHFFFAOYSA-N
Data: 2 IC50
Activity Spreadsheet -- Enzyme Inhibition Constant Data from BindingDB
Found 2 hits for monomerid = 50514282
Trg + Lig
Ki
nM
ΔG°
kcal/mole
IC50
nM
Kd
nM
EC50/IC50
nM
koff
s-1
kon
M-1s-1
pHTemp
°C
Estrogen receptor
(Homo sapiens (Human))
BDBM50514282
(CHEMBL4543096)
Show SMILES Cc1cc(F)cc(C)c1C(=O)c1sc2cc(O)ccc2c1Oc1ccc(OCCN2CC(CF)C2)cc1
Show InChI InChI=1S/C29H27F2NO4S/c1-17-11-20(31)12-18(2)26(17)27(34)29-28(24-8-3-21(33)13-25(24)37-29)36-23-6-4-22(5-7-23)35-10-9-32-15-19(14-30)16-32/h3-8,11-13,19,33H,9-10,14-16H2,1-2H3
n/an/a 3.5n/an/an/an/an/an/a
University of Illinois at Chicago
Curated by ChEMBL
Assay Description
Antagonist activity at ERalpha in human MCF7:WS8 cells incubated for 18 hrs by dual luciferase reporter gene assay relative to control
J Med Chem 62: 11301-11323 (2019)
Article DOI: 10.1021/acs.jmedchem.9b01580
Estrogen receptor
(Homo sapiens (Human))
BDBM50514282
(CHEMBL4543096)
Show SMILES Cc1cc(F)cc(C)c1C(=O)c1sc2cc(O)ccc2c1Oc1ccc(OCCN2CC(CF)C2)cc1
Show InChI InChI=1S/C29H27F2NO4S/c1-17-11-20(31)12-18(2)26(17)27(34)29-28(24-8-3-21(33)13-25(24)37-29)36-23-6-4-22(5-7-23)35-10-9-32-15-19(14-30)16-32/h3-8,11-13,19,33H,9-10,14-16H2,1-2H3
n/an/a 1.40n/an/an/an/an/an/a
University of Illinois at Chicago
Curated by ChEMBL
Assay Description
Inhibition of ERalpha in human MCF7:WS8 cells assessed as increase in degradation of ERalpha incubated for 24 hrs by In-Cell Western assay
J Med Chem 62: 11301-11323 (2019)
Article DOI: 10.1021/acs.jmedchem.9b01580