BDBM50514738 CHEMBL4536304
SMILES: CCOP(=O)(OCC)C1N=CC2C1C(=O)N(C2=O)c1ccc(OC)cc1
InChI Key: InChIKey=RCUIZXHMVBJQPJ-UHFFFAOYSA-N
Data: 1 KI  1 IC50
Activity Spreadsheet -- Enzyme Inhibition Constant Data from BindingDB
Found 2 hits for monomerid = 50514738
Trg + Lig
Ki
nM
ΔG°
kcal/mole
IC50
nM
Kd
nM
EC50/IC50
nM
koff
s-1
kon
M-1s-1
pHTemp
°C
Alpha-2A adrenergic receptor
(Homo sapiens)
BDBM50514738
(CHEMBL4536304)
Show SMILES CCOP(=O)(OCC)C1N=CC2C1C(=O)N(C2=O)c1ccc(OC)cc1 |c:9|
Show InChI InChI=1S/C17H21N2O6P/c1-4-24-26(22,25-5-2)15-14-13(10-18-15)16(20)19(17(14)21)11-6-8-12(23-3)9-7-11/h6-10,13-15H,4-5H2,1-3H3
0.0537n/an/an/an/an/an/an/an/a
University of Barcelona
Curated by ChEMBL
Assay Description
Displacement of [3H]RX821002 from alpha2-AR in human brain frontal cortex incubated for 30 mins by liquid scintillation spectrometry
J Med Chem 63: 3610-3633 (2020)
Article DOI: 10.1021/acs.jmedchem.9b02080
Nischarin
(Homo sapiens (Human))
BDBM50514738
(CHEMBL4536304)
Show SMILES CCOP(=O)(OCC)C1N=CC2C1C(=O)N(C2=O)c1ccc(OC)cc1 |c:9|
Show InChI InChI=1S/C17H21N2O6P/c1-4-24-26(22,25-5-2)15-14-13(10-18-15)16(20)19(17(14)21)11-6-8-12(23-3)9-7-11/h6-10,13-15H,4-5H2,1-3H3
n/an/a 8.10n/an/an/an/an/an/a
University of Barcelona
Curated by ChEMBL
Assay Description
Displacement of [3H]clonidine from I1IR in human brain frontal cortex in presence of adrenaline incubated for 45 mins by liquid scintillation spectro...
J Med Chem 63: 3610-3633 (2020)
Article DOI: 10.1021/acs.jmedchem.9b02080