BDBM50517468 CHEMBL4559294
SMILES: Clc1cccc(c1)-c1ccc(NS(=O)(=O)c2ccccn2)c2ncccc12
InChI Key: InChIKey=GOKCYGBTMXRNRW-UHFFFAOYSA-N
Data: 1 IC50
Activity Spreadsheet -- Enzyme Inhibition Constant Data from BindingDB
Found 1 hit for monomerid = 50517468
Trg + Lig
Ki
nM
ΔG°
kcal/mole
IC50
nM
Kd
nM
EC50/IC50
nM
koff
s-1
kon
M-1s-1
pHTemp
°C
Glyoxalase I
(Homo sapiens (Human))
BDBM50517468
(CHEMBL4559294)
Show SMILES Clc1cccc(c1)-c1ccc(NS(=O)(=O)c2ccccn2)c2ncccc12
Show InChI InChI=1S/C20H14ClN3O2S/c21-15-6-3-5-14(13-15)16-9-10-18(20-17(16)7-4-12-23-20)24-27(25,26)19-8-1-2-11-22-19/h1-13,24H
n/an/a 370n/an/an/an/an/an/a
TBA
Curated by ChEMBL
Assay Description
Inhibition recombinant human N-terminal 6His-tagged GLO1 (2 to 184 residues) expressed in Escherichia coli using MG as substrate preincubated for 15 ...
J Med Chem 62: 1609-1625 (2019)
Article DOI: 10.1021/acs.jmedchem.8b01868