BDBM50517469 CHEMBL4543065
SMILES: Clc1ccc(cc1)-c1ccc(NS(=O)(=O)c2ccccn2)c2ncccc12
InChI Key: InChIKey=DGVQIZHBVQFKJK-UHFFFAOYSA-N
Data: 1 IC50
Activity Spreadsheet -- Enzyme Inhibition Constant Data from BindingDB
Found 1 hit for monomerid = 50517469
Trg + Lig
Ki
nM
ΔG°
kcal/mole
IC50
nM
Kd
nM
EC50/IC50
nM
koff
s-1
kon
M-1s-1
pHTemp
°C
Glyoxalase I
(Homo sapiens (Human))
BDBM50517469
(CHEMBL4543065)
Show SMILES Clc1ccc(cc1)-c1ccc(NS(=O)(=O)c2ccccn2)c2ncccc12
Show InChI InChI=1S/C20H14ClN3O2S/c21-15-8-6-14(7-9-15)16-10-11-18(20-17(16)4-3-13-23-20)24-27(25,26)19-5-1-2-12-22-19/h1-13,24H
n/an/a 480n/an/an/an/an/an/a
TBA
Curated by ChEMBL
Assay Description
Inhibition recombinant human N-terminal 6His-tagged GLO1 (2 to 184 residues) expressed in Escherichia coli using MG as substrate preincubated for 15 ...
J Med Chem 62: 1609-1625 (2019)
Article DOI: 10.1021/acs.jmedchem.8b01868