BDBM50519921 CHEMBL4438763
SMILES: Clc1cccc(c1)-c1cc(=O)c2ccc3ccccc3c2s1
InChI Key: InChIKey=LBZBOWMAEGALTF-UHFFFAOYSA-N
Data: 3 IC50
Activity Spreadsheet -- Enzyme Inhibition Constant Data from BindingDB
Found 3 hits for monomerid = 50519921
Trg + Lig
Ki
nM
ΔG°
kcal/mole
IC50
nM
Kd
nM
EC50/IC50
nM
koff
s-1
kon
M-1s-1
pHTemp
°C
Cytochrome P450 1A
(Homo sapiens (Human))
BDBM50519921
(CHEMBL4438763)
Show SMILES Clc1cccc(c1)-c1cc(=O)c2ccc3ccccc3c2s1
Show InChI InChI=1S/C19H11ClOS/c20-14-6-3-5-13(10-14)18-11-17(21)16-9-8-12-4-1-2-7-15(12)19(16)22-18/h1-11H
Reactome pathway
n/an/a 296n/an/an/an/an/an/a
Shanghai Jiao Tong University
Curated by ChEMBL
Assay Description
Inhibition of human recombinant CYP1A2 using 7-ethoxyresorufin as substrate in presence of glucose-6-phosphate, glucose-6-phosphate dehydrogenase and...
Eur J Med Chem 187: (2020)
Article DOI: 10.1016/j.ejmech.2019.111938
Cytochrome P450 1A
(Homo sapiens (Human))
BDBM50519921
(CHEMBL4438763)
Show SMILES Clc1cccc(c1)-c1cc(=O)c2ccc3ccccc3c2s1
Show InChI InChI=1S/C19H11ClOS/c20-14-6-3-5-13(10-14)18-11-17(21)16-9-8-12-4-1-2-7-15(12)19(16)22-18/h1-11H
Reactome pathway
n/an/a 14n/an/an/an/an/an/a
Shanghai Jiao Tong University
Curated by ChEMBL
Assay Description
Inhibition of human recombinant CYP1A1 using 7-ethoxyresorufin as substrate in presence of glucose-6-phosphate, glucose-6-phosphate dehydrogenase and...
Eur J Med Chem 187: (2020)
Article DOI: 10.1016/j.ejmech.2019.111938
Cytochrome P450 1B1
(Homo sapiens (Human))
BDBM50519921
(CHEMBL4438763)
Show SMILES Clc1cccc(c1)-c1cc(=O)c2ccc3ccccc3c2s1
Show InChI InChI=1S/C19H11ClOS/c20-14-6-3-5-13(10-14)18-11-17(21)16-9-8-12-4-1-2-7-15(12)19(16)22-18/h1-11H
Reactome pathway
n/an/a 41n/an/an/an/an/an/a
Shanghai Jiao Tong University
Curated by ChEMBL
Assay Description
Inhibition of human recombinant CYP1B1 using 7-ethoxyresorufin as substrate in presence of glucose-6-phosphate, glucose-6-phosphate dehydrogenase and...
Eur J Med Chem 187: (2020)
Article DOI: 10.1016/j.ejmech.2019.111938