BDBM50519948 CHEMBL1700161
SMILES: Fc1ccc(F)c(c1)S(=O)(=O)NC(=N)NCCc1c[nH]c2ccccc12
InChI Key: InChIKey=KLIVXGVUVONPGE-UHFFFAOYSA-N
Data: 1 KI  3 IC50
Activity Spreadsheet -- Enzyme Inhibition Constant Data from BindingDB
Found 4 hits for monomerid = 50519948
Trg + Lig
Ki
nM
ΔG°
kcal/mole
IC50
nM
Kd
nM
EC50/IC50
nM
koff
s-1
kon
M-1s-1
pHTemp
°C
Aminopeptidase
(Homo sapiens (Human))
BDBM50519948
(CHEMBL1700161)
Show SMILES Fc1ccc(F)c(c1)S(=O)(=O)NC(=N)NCCc1c[nH]c2ccccc12
Show InChI InChI=1S/C17H16F2N4O2S/c18-12-5-6-14(19)16(9-12)26(24,25)23-17(20)21-8-7-11-10-22-15-4-2-1-3-13(11)15/h1-6,9-10,22H,7-8H2,(H3,20,21,23)
Reactome pathway
5.17E+4n/an/an/an/an/an/an/an/a
Kansas University Specialized Chemistry Center
Curated by ChEMBL
Assay Description
Competitive inhibition of recombinant human C-terminal His6-tagged ERAP1 expressed in baculovirus infected BTA-TN-5B1-4 insect cells using varying le...
J Med Chem 63: 103-121 (2020)
Article DOI: 10.1021/acs.jmedchem.9b00293
Aminopeptidase
(Homo sapiens (Human))
BDBM50519948
(CHEMBL1700161)
Show SMILES Fc1ccc(F)c(c1)S(=O)(=O)NC(=N)NCCc1c[nH]c2ccccc12
Show InChI InChI=1S/C17H16F2N4O2S/c18-12-5-6-14(19)16(9-12)26(24,25)23-17(20)21-8-7-11-10-22-15-4-2-1-3-13(11)15/h1-6,9-10,22H,7-8H2,(H3,20,21,23)
Reactome pathway
n/an/a 9.20E+3n/an/an/an/an/an/a
Kansas University Specialized Chemistry Center
Curated by ChEMBL
Assay Description
Inhibition of recombinant human C-terminal His6-tagged ERAP1 expressed in baculovirus infected BTA-TN-5B1-4 insect cells using L-AMC as substrate mea...
J Med Chem 63: 103-121 (2020)
Article DOI: 10.1021/acs.jmedchem.9b00293
Interleukin-1 receptor antagonist protein
(Mus musculus)
BDBM50519948
(CHEMBL1700161)
Show SMILES Fc1ccc(F)c(c1)S(=O)(=O)NC(=N)NCCc1c[nH]c2ccccc12
Show InChI InChI=1S/C17H16F2N4O2S/c18-12-5-6-14(19)16(9-12)26(24,25)23-17(20)21-8-7-11-10-22-15-4-2-1-3-13(11)15/h1-6,9-10,22H,7-8H2,(H3,20,21,23)
n/an/a<1.00E+6n/an/an/an/an/an/a
Kansas University Specialized Chemistry Center
Curated by ChEMBL
Assay Description
Inhibition of recombinant mouse C-terminal His6-tagged IRAP expressed in baculovirus infected BTA-TN-5B1-4 insect cells using L-AMC as substrate meas...
J Med Chem 63: 103-121 (2020)
Article DOI: 10.1021/acs.jmedchem.9b00293
Aminopeptidase
(Homo sapiens (Human))
BDBM50519948
(CHEMBL1700161)
Show SMILES Fc1ccc(F)c(c1)S(=O)(=O)NC(=N)NCCc1c[nH]c2ccccc12
Show InChI InChI=1S/C17H16F2N4O2S/c18-12-5-6-14(19)16(9-12)26(24,25)23-17(20)21-8-7-11-10-22-15-4-2-1-3-13(11)15/h1-6,9-10,22H,7-8H2,(H3,20,21,23)
Reactome pathway
n/an/a<1.00E+6n/an/an/an/an/an/a
Kansas University Specialized Chemistry Center
Curated by ChEMBL
Assay Description
Inhibition of recombinant human C-terminal His6-tagged ERAP2 expressed in baculovirus infected BTA-TN-5B1-4 insect cells using R-AMC as substrate mea...
J Med Chem 63: 103-121 (2020)
Article DOI: 10.1021/acs.jmedchem.9b00293