BDBM50523894 CHEMBL4535400
SMILES: ONC(=O)[C@H]1CCCC1S(=O)(=O)c1ccc(NC(=O)c2ccc(cc2)[N+]([O-])=O)cc1
InChI Key: InChIKey=OIQMFKLUPFKRJF-BHWOMJMDSA-N
Data: 2 IC50
Activity Spreadsheet -- Enzyme Inhibition Constant Data from BindingDB
Found 2 hits for monomerid = 50523894
Trg + Lig
Ki
nM
ΔG°
kcal/mole
IC50
nM
Kd
nM
EC50/IC50
nM
koff
s-1
kon
M-1s-1
pHTemp
°C
Matrix metalloproteinase-9
(Homo sapiens (Human))
BDBM50523894
(CHEMBL4535400)
Show SMILES ONC(=O)[C@H]1CCCC1S(=O)(=O)c1ccc(NC(=O)c2ccc(cc2)[N+]([O-])=O)cc1 |r|
Show InChI InChI=1S/C19H19N3O7S/c23-18(12-4-8-14(9-5-12)22(26)27)20-13-6-10-15(11-7-13)30(28,29)17-3-1-2-16(17)19(24)21-25/h4-11,16-17,25H,1-3H2,(H,20,23)(H,21,24)/t16-,17?/m0/s1
Reactome pathway
n/an/a 0.122n/an/an/an/an/an/a
University of Florence
Curated by ChEMBL
Assay Description
Inhibition of MMP9 (unknown origin) pre-incubated for 5 mins before Mca-Lys-Pro-Leu-Gly-Leu-Dpa-Ala-Arg-NH2 fluorogenic substrate addition and measur...
Bioorg Med Chem 27: 1891-1902 (2019)
Article DOI: 10.1016/j.bmc.2019.03.043
72 kDa type IV collagenase
(Homo sapiens (Human))
BDBM50523894
(CHEMBL4535400)
Show SMILES ONC(=O)[C@H]1CCCC1S(=O)(=O)c1ccc(NC(=O)c2ccc(cc2)[N+]([O-])=O)cc1 |r|
Show InChI InChI=1S/C19H19N3O7S/c23-18(12-4-8-14(9-5-12)22(26)27)20-13-6-10-15(11-7-13)30(28,29)17-3-1-2-16(17)19(24)21-25/h4-11,16-17,25H,1-3H2,(H,20,23)(H,21,24)/t16-,17?/m0/s1
Reactome pathway
n/an/a 0.0960n/an/an/an/an/an/a
University of Florence
Curated by ChEMBL
Assay Description
Inhibition of MMP2 (unknown origin) pre-incubated for 5 mins before Mca-Lys-Pro-Leu-Gly-Leu-Dpa-Ala-Arg-NH2 fluorogenic substrate addition and measur...
Bioorg Med Chem 27: 1891-1902 (2019)
Article DOI: 10.1016/j.bmc.2019.03.043