null
SMILES: COc1cc(Nc2ccnc3ccc(cc23)C(F)(F)F)cc(OC)c1OC
InChI Key: InChIKey=ZUNCPEIOPMEIGV-UHFFFAOYSA-N
Activity Spreadsheet -- Enzyme Inhibition Constant Data from BindingDB
Found 20 hits for monomerid = 50524289
Trg + Lig
Ki
nM
ΔG°
kcal/mole
IC50
nM
Kd
nM
EC50/IC50
nM
koff
s-1
kon
M-1s-1
pHTemp
°C
Cyclin-G-associated kinase
(Homo sapiens (Human))
BDBM50524289
(CHEMBL535429 | TCMDC-138471)
Show SMILES COc1cc(Nc2ccnc3ccc(cc23)C(F)(F)F)cc(OC)c1OC
Show InChI InChI=1S/C19H17F3N2O3/c1-25-16-9-12(10-17(26-2)18(16)27-3)24-15-6-7-23-14-5-4-11(8-13(14)15)19(20,21)22/h4-10H,1-3H3,(H,23,24)
Reactome pathway
n/an/a 170n/an/an/an/an/an/a
University of North Carolina at Chapel Hill
Curated by ChEMBL
Assay Description
Inhibition of tracer 5 binding to human N-terminal nano luciferase-fused GAK expressed in HEK293 cells measured after 2 hrs by nanoBRET assay
J Med Chem 62: 4772-4778 (2019)
Article DOI: 10.1021/acs.jmedchem.9b00350
Cyclin-G-associated kinase
(Homo sapiens (Human))
BDBM50524289
(CHEMBL535429 | TCMDC-138471)
Show SMILES COc1cc(Nc2ccnc3ccc(cc23)C(F)(F)F)cc(OC)c1OC
Show InChI InChI=1S/C19H17F3N2O3/c1-25-16-9-12(10-17(26-2)18(16)27-3)24-15-6-7-23-14-5-4-11(8-13(14)15)19(20,21)22/h4-10H,1-3H3,(H,23,24)
Reactome pathway
n/an/an/a 31n/an/an/an/an/a
TBA
Citation and Details
Cyclin-G-associated kinase
(Homo sapiens (Human))
BDBM50524289
(CHEMBL535429 | TCMDC-138471)
Show SMILES COc1cc(Nc2ccnc3ccc(cc23)C(F)(F)F)cc(OC)c1OC
Show InChI InChI=1S/C19H17F3N2O3/c1-25-16-9-12(10-17(26-2)18(16)27-3)24-15-6-7-23-14-5-4-11(8-13(14)15)19(20,21)22/h4-10H,1-3H3,(H,23,24)
Reactome pathway
n/an/an/a 31n/an/an/an/an/a
University of North Carolina at Chapel Hill
Curated by ChEMBL
Assay Description
Binding affinity to wild-type human partial length GAK (G13 to Y338 residues) expressed in bacterial expression system by Kinomescan method
J Med Chem 62: 4772-4778 (2019)
Article DOI: 10.1021/acs.jmedchem.9b00350
Atypical kinase COQ8A, mitochondrial
(Homo sapiens (Human))
BDBM50524289
(CHEMBL535429 | TCMDC-138471)
Show SMILES COc1cc(Nc2ccnc3ccc(cc23)C(F)(F)F)cc(OC)c1OC
Show InChI InChI=1S/C19H17F3N2O3/c1-25-16-9-12(10-17(26-2)18(16)27-3)24-15-6-7-23-14-5-4-11(8-13(14)15)19(20,21)22/h4-10H,1-3H3,(H,23,24)
n/an/an/a 220n/an/an/an/an/a
Johann Wolfgang Goethe University
Curated by ChEMBL
Assay Description
Binding affinity to biotinylated full length human ADCK3 expressed in Escherichia coli incubated for 1.5 hrs by fluorescent tracer dependent TR-FRET ...
J Med Chem 62: 2830-2836 (2019)
Article DOI: 10.1021/acs.jmedchem.8b01213
Serine/threonine-protein kinase NLK
(Homo sapiens (Human))
BDBM50524289
(CHEMBL535429 | TCMDC-138471)
Show SMILES COc1cc(Nc2ccnc3ccc(cc23)C(F)(F)F)cc(OC)c1OC
Show InChI InChI=1S/C19H17F3N2O3/c1-25-16-9-12(10-17(26-2)18(16)27-3)24-15-6-7-23-14-5-4-11(8-13(14)15)19(20,21)22/h4-10H,1-3H3,(H,23,24)
NCI pathway
Reactome pathway
n/an/an/a 790n/an/an/an/an/a
Johann Wolfgang Goethe University
Curated by ChEMBL
Assay Description
Binding affinity to biotinylated full length human NLK expressed in Escherichia coli incubated for 1.5 hrs by fluorescent tracer dependent TR-FRET ba...
J Med Chem 62: 2830-2836 (2019)
Article DOI: 10.1021/acs.jmedchem.8b01213
Cyclin-G-associated kinase
(Homo sapiens (Human))
BDBM50524289
(CHEMBL535429 | TCMDC-138471)
Show SMILES COc1cc(Nc2ccnc3ccc(cc23)C(F)(F)F)cc(OC)c1OC
Show InChI InChI=1S/C19H17F3N2O3/c1-25-16-9-12(10-17(26-2)18(16)27-3)24-15-6-7-23-14-5-4-11(8-13(14)15)19(20,21)22/h4-10H,1-3H3,(H,23,24)
Reactome pathway
n/an/an/a 31n/an/an/an/an/a
Johann Wolfgang Goethe University
Curated by ChEMBL
Assay Description
Binding affinity to biotinylated human GAK (13 to 338 residues) expressed in Escherichia coli incubated for 1.5 hrs by fluorescent tracer dependent T...
J Med Chem 62: 2830-2836 (2019)
Article DOI: 10.1021/acs.jmedchem.8b01213
Receptor-interacting serine/threonine-protein kinase 2
(Homo sapiens (Human))
BDBM50524289
(CHEMBL535429 | TCMDC-138471)
Show SMILES COc1cc(Nc2ccnc3ccc(cc23)C(F)(F)F)cc(OC)c1OC
Show InChI InChI=1S/C19H17F3N2O3/c1-25-16-9-12(10-17(26-2)18(16)27-3)24-15-6-7-23-14-5-4-11(8-13(14)15)19(20,21)22/h4-10H,1-3H3,(H,23,24)
n/an/an/a 180n/an/an/an/an/a
Johann Wolfgang Goethe University
Curated by ChEMBL
Assay Description
Binding affinity to biotinylated human RIPK2 (1 to 310 residues) expressed in Escherichia coli incubated for 1.5 hrs by fluorescent tracer dependent ...
J Med Chem 62: 2830-2836 (2019)
Article DOI: 10.1021/acs.jmedchem.8b01213
Cyclin-G-associated kinase
(Homo sapiens (Human))
BDBM50524289
(CHEMBL535429 | TCMDC-138471)
Show SMILES COc1cc(Nc2ccnc3ccc(cc23)C(F)(F)F)cc(OC)c1OC
Show InChI InChI=1S/C19H17F3N2O3/c1-25-16-9-12(10-17(26-2)18(16)27-3)24-15-6-7-23-14-5-4-11(8-13(14)15)19(20,21)22/h4-10H,1-3H3,(H,23,24)
Reactome pathway
n/an/an/a 31n/an/an/an/an/a
Johann Wolfgang Goethe University
Curated by ChEMBL
Assay Description
Binding affinity to GAK (unknown origin)
J Med Chem 62: 2830-2836 (2019)
Article DOI: 10.1021/acs.jmedchem.8b01213
Cyclin-G-associated kinase
(Homo sapiens (Human))
BDBM50524289
(CHEMBL535429 | TCMDC-138471)
Show SMILES COc1cc(Nc2ccnc3ccc(cc23)C(F)(F)F)cc(OC)c1OC
Show InChI InChI=1S/C19H17F3N2O3/c1-25-16-9-12(10-17(26-2)18(16)27-3)24-15-6-7-23-14-5-4-11(8-13(14)15)19(20,21)22/h4-10H,1-3H3,(H,23,24)
Reactome pathway
n/an/an/a 10n/an/an/an/an/a
TBA
Citation and Details
Tyrosine-protein kinase ABL1
(Homo sapiens (Human))
BDBM50524289
(CHEMBL535429 | TCMDC-138471)
Show SMILES COc1cc(Nc2ccnc3ccc(cc23)C(F)(F)F)cc(OC)c1OC
Show InChI InChI=1S/C19H17F3N2O3/c1-25-16-9-12(10-17(26-2)18(16)27-3)24-15-6-7-23-14-5-4-11(8-13(14)15)19(20,21)22/h4-10H,1-3H3,(H,23,24)
Reactome pathway
n/an/an/a 1.90E+3n/an/an/an/an/a
TBA
Citation and Details
Atypical kinase COQ8A, mitochondrial
(Homo sapiens (Human))
BDBM50524289
(CHEMBL535429 | TCMDC-138471)
Show SMILES COc1cc(Nc2ccnc3ccc(cc23)C(F)(F)F)cc(OC)c1OC
Show InChI InChI=1S/C19H17F3N2O3/c1-25-16-9-12(10-17(26-2)18(16)27-3)24-15-6-7-23-14-5-4-11(8-13(14)15)19(20,21)22/h4-10H,1-3H3,(H,23,24)
n/an/an/a 300n/an/an/an/an/a
TBA
Citation and Details
Ephrin type-A receptor 1
(Homo sapiens (Human))
BDBM50524289
(CHEMBL535429 | TCMDC-138471)
Show SMILES COc1cc(Nc2ccnc3ccc(cc23)C(F)(F)F)cc(OC)c1OC
Show InChI InChI=1S/C19H17F3N2O3/c1-25-16-9-12(10-17(26-2)18(16)27-3)24-15-6-7-23-14-5-4-11(8-13(14)15)19(20,21)22/h4-10H,1-3H3,(H,23,24)
n/an/an/a 3.10E+3n/an/an/an/an/a
TBA
Citation and Details
Ephrin type-A receptor 8
(Homo sapiens (Human))
BDBM50524289
(CHEMBL535429 | TCMDC-138471)
Show SMILES COc1cc(Nc2ccnc3ccc(cc23)C(F)(F)F)cc(OC)c1OC
Show InChI InChI=1S/C19H17F3N2O3/c1-25-16-9-12(10-17(26-2)18(16)27-3)24-15-6-7-23-14-5-4-11(8-13(14)15)19(20,21)22/h4-10H,1-3H3,(H,23,24)
NCI pathway
Reactome pathway
n/an/an/a 1.10E+3n/an/an/an/an/a
TBA
Citation and Details
Ephrin type-B receptor 6
(Homo sapiens (Human))
BDBM50524289
(CHEMBL535429 | TCMDC-138471)
Show SMILES COc1cc(Nc2ccnc3ccc(cc23)C(F)(F)F)cc(OC)c1OC
Show InChI InChI=1S/C19H17F3N2O3/c1-25-16-9-12(10-17(26-2)18(16)27-3)24-15-6-7-23-14-5-4-11(8-13(14)15)19(20,21)22/h4-10H,1-3H3,(H,23,24)
Reactome pathway
n/an/an/a 1.60E+3n/an/an/an/an/a
TBA
Citation and Details
Tyrosine-protein kinase Lck
(Homo sapiens (Human))
BDBM50524289
(CHEMBL535429 | TCMDC-138471)
Show SMILES COc1cc(Nc2ccnc3ccc(cc23)C(F)(F)F)cc(OC)c1OC
Show InChI InChI=1S/C19H17F3N2O3/c1-25-16-9-12(10-17(26-2)18(16)27-3)24-15-6-7-23-14-5-4-11(8-13(14)15)19(20,21)22/h4-10H,1-3H3,(H,23,24)
n/an/an/a 1.10E+3n/an/an/an/an/a
TBA
Citation and Details
Serine/threonine-protein kinase NLK
(Homo sapiens (Human))
BDBM50524289
(CHEMBL535429 | TCMDC-138471)
Show SMILES COc1cc(Nc2ccnc3ccc(cc23)C(F)(F)F)cc(OC)c1OC
Show InChI InChI=1S/C19H17F3N2O3/c1-25-16-9-12(10-17(26-2)18(16)27-3)24-15-6-7-23-14-5-4-11(8-13(14)15)19(20,21)22/h4-10H,1-3H3,(H,23,24)
NCI pathway
Reactome pathway
n/an/an/a 690n/an/an/an/an/a
TBA
Citation and Details
Receptor-interacting serine/threonine-protein kinase 2
(Homo sapiens (Human))
BDBM50524289
(CHEMBL535429 | TCMDC-138471)
Show SMILES COc1cc(Nc2ccnc3ccc(cc23)C(F)(F)F)cc(OC)c1OC
Show InChI InChI=1S/C19H17F3N2O3/c1-25-16-9-12(10-17(26-2)18(16)27-3)24-15-6-7-23-14-5-4-11(8-13(14)15)19(20,21)22/h4-10H,1-3H3,(H,23,24)
n/an/an/a 890n/an/an/an/an/a
TBA
Citation and Details
Tyrosine-protein kinase TXK
(Homo sapiens (Human))
BDBM50524289
(CHEMBL535429 | TCMDC-138471)
Show SMILES COc1cc(Nc2ccnc3ccc(cc23)C(F)(F)F)cc(OC)c1OC
Show InChI InChI=1S/C19H17F3N2O3/c1-25-16-9-12(10-17(26-2)18(16)27-3)24-15-6-7-23-14-5-4-11(8-13(14)15)19(20,21)22/h4-10H,1-3H3,(H,23,24)
n/an/an/a 1.40E+3n/an/an/an/an/a
TBA
Citation and Details
Cyclin-G-associated kinase
(Homo sapiens (Human))
BDBM50524289
(CHEMBL535429 | TCMDC-138471)
Show SMILES COc1cc(Nc2ccnc3ccc(cc23)C(F)(F)F)cc(OC)c1OC
Show InChI InChI=1S/C19H17F3N2O3/c1-25-16-9-12(10-17(26-2)18(16)27-3)24-15-6-7-23-14-5-4-11(8-13(14)15)19(20,21)22/h4-10H,1-3H3,(H,23,24)
Reactome pathway
n/an/a 210n/an/an/an/an/an/a
TBA
Citation and Details
Epidermal growth factor receptor
(Homo sapiens (Human))
BDBM50524289
(CHEMBL535429 | TCMDC-138471)
Show SMILES COc1cc(Nc2ccnc3ccc(cc23)C(F)(F)F)cc(OC)c1OC
Show InChI InChI=1S/C19H17F3N2O3/c1-25-16-9-12(10-17(26-2)18(16)27-3)24-15-6-7-23-14-5-4-11(8-13(14)15)19(20,21)22/h4-10H,1-3H3,(H,23,24)
n/an/a>5.00E+4n/an/an/an/an/an/a
University of North Carolina at Chapel Hill
Curated by ChEMBL
Assay Description
Inhibition of EGFR in human A431 cells assessed as reduction in EGF-stimulated EGFR autophosphorylation preincuabted for 90 mins followed by EGF-stim...
J Med Chem 62: 4772-4778 (2019)
Article DOI: 10.1021/acs.jmedchem.9b00350