BDBM50529426 CHEMBL4475970
SMILES: FC(F)(F)Oc1ccccc1CN1CCN(CC1=O)c1cn[nH]c(=O)c1Cl
InChI Key: InChIKey=TWTOUKFJYMYLBR-UHFFFAOYSA-N
Data: 1 IC50
Activity Spreadsheet -- Enzyme Inhibition Constant Data from BindingDB
Found 1 hit for monomerid = 50529426
Trg + Lig
Ki
nM
ΔG°
kcal/mole
IC50
nM
Kd
nM
EC50/IC50
nM
koff
s-1
kon
M-1s-1
pHTemp
°C
Transient receptor protein 5 (TRPC5)
(Homo sapiens (Human))
BDBM50529426
(CHEMBL4475970)
Show SMILES FC(F)(F)Oc1ccccc1CN1CCN(CC1=O)c1cn[nH]c(=O)c1Cl
Show InChI InChI=1S/C16H14ClF3N4O3/c17-14-11(7-21-22-15(14)26)23-5-6-24(13(25)9-23)8-10-3-1-2-4-12(10)27-16(18,19)20/h1-4,7H,5-6,8-9H2,(H,22,26)
n/an/a 530n/an/an/an/an/an/a
Goldfinch Bio Inc.
Curated by ChEMBL
Assay Description
Inhibition of rosiglitazone-activated human TRPC5 channel expressed in HEK293 cells assessed as reduction in Ca2+ current measured at +80 mV with hol...
ACS Med Chem Lett 10: 1579-1585 (2019)
Article DOI: 10.1021/acsmedchemlett.9b00430