BDBM50529958 CHEMBL4472693
SMILES: [#6]-[#6]-[#8]-[#6](=O)-[#7]-1-[#6]-[#6]\[#6](-[#6]-[#6]-1)=[#6]/C#Cc1cccc(Cl)c1
InChI Key: InChIKey=DQAANNFMBDRCGQ-UHFFFAOYSA-N
Data: 4 KI  8 IC50
Activity Spreadsheet -- Enzyme Inhibition Constant Data from BindingDB
Found 12 hits for monomerid = 50529958
Trg + Lig
Ki
nM
ΔG°
kcal/mole
IC50
nM
Kd
nM
EC50/IC50
nM
koff
s-1
kon
M-1s-1
pHTemp
°C
Metabotropic glutamate receptor 5
(Homo sapiens (Human))
BDBM50529958
(CHEMBL4472693)
Show SMILES [#6]-[#6]-[#8]-[#6](=O)-[#7]-1-[#6]-[#6]\[#6](-[#6]-[#6]-1)=[#6]/C#Cc1cccc(Cl)c1
Show InChI InChI=1S/C17H18ClNO2/c1-2-21-17(20)19-11-9-14(10-12-19)5-3-6-15-7-4-8-16(18)13-15/h4-5,7-8,13H,2,9-12H2,1H3
0.700n/an/an/an/an/an/an/an/a
Recordati S.p.A.
Curated by ChEMBL
Assay Description
Displacement of [3H]MPEP from human mGlu5 receptor expressed in CHO-TREx cell membranes after 60 mins by liquid scintillation spectrometric analysis
J Med Chem 62: 1246-1273 (2019)
Article DOI: 10.1021/acs.jmedchem.8b01226
Metabotropic glutamate receptor 5
(Homo sapiens (Human))
BDBM50529958
(CHEMBL4472693)
Show SMILES [#6]-[#6]-[#8]-[#6](=O)-[#7]-1-[#6]-[#6]\[#6](-[#6]-[#6]-1)=[#6]/C#Cc1cccc(Cl)c1
Show InChI InChI=1S/C17H18ClNO2/c1-2-21-17(20)19-11-9-14(10-12-19)5-3-6-15-7-4-8-16(18)13-15/h4-5,7-8,13H,2,9-12H2,1H3
0.700n/an/an/an/an/an/an/an/a
Recordati S.p.A.
Curated by ChEMBL
Assay Description
Displacement of [3H]MPEP from human mGlu5 receptor expressed in CHO-TREx cell membranes after 60 mins by liquid scintillation spectrometric analysis
J Med Chem 62: 1246-1273 (2019)
Article DOI: 10.1021/acs.jmedchem.8b01226
Metabotropic glutamate receptor
(RAT)
BDBM50529958
(CHEMBL4472693)
Show SMILES [#6]-[#6]-[#8]-[#6](=O)-[#7]-1-[#6]-[#6]\[#6](-[#6]-[#6]-1)=[#6]/C#Cc1cccc(Cl)c1
Show InChI InChI=1S/C17H18ClNO2/c1-2-21-17(20)19-11-9-14(10-12-19)5-3-6-15-7-4-8-16(18)13-15/h4-5,7-8,13H,2,9-12H2,1H3
>1.00E+3n/an/an/an/an/an/an/an/a
Recordati S.p.A.
Curated by ChEMBL
Assay Description
Displacement of [3H]MPEP from rat mGlu1 receptor expressed in CHO-TREx cell membranes after 30 mins by liquid scintillation spectrometric analysis
J Med Chem 62: 1246-1273 (2019)
Article DOI: 10.1021/acs.jmedchem.8b01226
Metabotropic glutamate receptor
(RAT)
BDBM50529958
(CHEMBL4472693)
Show SMILES [#6]-[#6]-[#8]-[#6](=O)-[#7]-1-[#6]-[#6]\[#6](-[#6]-[#6]-1)=[#6]/C#Cc1cccc(Cl)c1
Show InChI InChI=1S/C17H18ClNO2/c1-2-21-17(20)19-11-9-14(10-12-19)5-3-6-15-7-4-8-16(18)13-15/h4-5,7-8,13H,2,9-12H2,1H3
>1.00E+3n/an/an/an/an/an/an/an/a
Recordati S.p.A.
Curated by ChEMBL
Assay Description
Displacement of [3H]MPEP from rat mGlu1 receptor expressed in CHO-TREx cell membranes after 30 mins by liquid scintillation spectrometric analysis
J Med Chem 62: 1246-1273 (2019)
Article DOI: 10.1021/acs.jmedchem.8b01226
Metabotropic glutamate receptor 5
(Homo sapiens (Human))
BDBM50529958
(CHEMBL4472693)
Show SMILES [#6]-[#6]-[#8]-[#6](=O)-[#7]-1-[#6]-[#6]\[#6](-[#6]-[#6]-1)=[#6]/C#Cc1cccc(Cl)c1
Show InChI InChI=1S/C17H18ClNO2/c1-2-21-17(20)19-11-9-14(10-12-19)5-3-6-15-7-4-8-16(18)13-15/h4-5,7-8,13H,2,9-12H2,1H3
n/an/a 2.5n/an/an/an/an/an/a
Recordati S.p.A.
Curated by ChEMBL
Assay Description
Negative allosteric modulation of human mGlu5 receptor expressed in CHO-TREx cell membranes assessed as reduction in quisqualate-induced Ca2+ mobiliz...
J Med Chem 62: 1246-1273 (2019)
Article DOI: 10.1021/acs.jmedchem.8b01226
Cytochrome P450 3A4
(Homo sapiens (Human))
BDBM50529958
(CHEMBL4472693)
Show SMILES [#6]-[#6]-[#8]-[#6](=O)-[#7]-1-[#6]-[#6]\[#6](-[#6]-[#6]-1)=[#6]/C#Cc1cccc(Cl)c1
Show InChI InChI=1S/C17H18ClNO2/c1-2-21-17(20)19-11-9-14(10-12-19)5-3-6-15-7-4-8-16(18)13-15/h4-5,7-8,13H,2,9-12H2,1H3
Reactome pathway
n/an/a 1.28E+4n/an/an/an/an/an/a
Recordati S.p.A.
Curated by ChEMBL
Assay Description
Inhibition of recombinant human CYP3A4 using 7-benzyloxy-trifluoromethylcoumarin as substrate preincubated for 10 mins followed by substrate addition...
J Med Chem 62: 1246-1273 (2019)
Article DOI: 10.1021/acs.jmedchem.8b01226
Cytochrome P450 1A2
(Homo sapiens (Human))
BDBM50529958
(CHEMBL4472693)
Show SMILES [#6]-[#6]-[#8]-[#6](=O)-[#7]-1-[#6]-[#6]\[#6](-[#6]-[#6]-1)=[#6]/C#Cc1cccc(Cl)c1
Show InChI InChI=1S/C17H18ClNO2/c1-2-21-17(20)19-11-9-14(10-12-19)5-3-6-15-7-4-8-16(18)13-15/h4-5,7-8,13H,2,9-12H2,1H3
n/an/a<700n/an/an/an/an/an/a
Recordati S.p.A.
Curated by ChEMBL
Assay Description
Inhibition of recombinant human CYP1A2 using 3-cyano-7-ethoxycoumarin as substrate preincubated for 10 mins followed by substrate addition and measur...
J Med Chem 62: 1246-1273 (2019)
Article DOI: 10.1021/acs.jmedchem.8b01226
Metabotropic glutamate receptor 5
(Homo sapiens (Human))
BDBM50529958
(CHEMBL4472693)
Show SMILES [#6]-[#6]-[#8]-[#6](=O)-[#7]-1-[#6]-[#6]\[#6](-[#6]-[#6]-1)=[#6]/C#Cc1cccc(Cl)c1
Show InChI InChI=1S/C17H18ClNO2/c1-2-21-17(20)19-11-9-14(10-12-19)5-3-6-15-7-4-8-16(18)13-15/h4-5,7-8,13H,2,9-12H2,1H3
n/an/a 2.5n/an/an/an/an/an/a
Recordati S.p.A.
Curated by ChEMBL
Assay Description
Negative allosteric modulation of human mGlu5 receptor expressed in CHO-TREx cell membranes assessed as reduction in quisqualate-induced Ca2+ mobiliz...
J Med Chem 62: 1246-1273 (2019)
Article DOI: 10.1021/acs.jmedchem.8b01226
Cytochrome P450 2D6
(Homo sapiens (Human))
BDBM50529958
(CHEMBL4472693)
Show SMILES [#6]-[#6]-[#8]-[#6](=O)-[#7]-1-[#6]-[#6]\[#6](-[#6]-[#6]-1)=[#6]/C#Cc1cccc(Cl)c1
Show InChI InChI=1S/C17H18ClNO2/c1-2-21-17(20)19-11-9-14(10-12-19)5-3-6-15-7-4-8-16(18)13-15/h4-5,7-8,13H,2,9-12H2,1H3
n/an/a>2.00E+4n/an/an/an/an/an/a
Recordati S.p.A.
Curated by ChEMBL
Assay Description
Inhibition of recombinant human CYP2D6 using 3-[2-(N,N-diethylamino)ethyl]-7-methoxy-4-methylcoumarin as substrate preincubated for 10 mins followed ...
J Med Chem 62: 1246-1273 (2019)
Article DOI: 10.1021/acs.jmedchem.8b01226
Cytochrome P450 1A2
(Homo sapiens (Human))
BDBM50529958
(CHEMBL4472693)
Show SMILES [#6]-[#6]-[#8]-[#6](=O)-[#7]-1-[#6]-[#6]\[#6](-[#6]-[#6]-1)=[#6]/C#Cc1cccc(Cl)c1
Show InChI InChI=1S/C17H18ClNO2/c1-2-21-17(20)19-11-9-14(10-12-19)5-3-6-15-7-4-8-16(18)13-15/h4-5,7-8,13H,2,9-12H2,1H3
n/an/a<700n/an/an/an/an/an/a
Recordati S.p.A.
Curated by ChEMBL
Assay Description
Inhibition of recombinant human CYP1A2 using 3-cyano-7-ethoxycoumarin as substrate preincubated for 10 mins followed by substrate addition and measur...
J Med Chem 62: 1246-1273 (2019)
Article DOI: 10.1021/acs.jmedchem.8b01226
Cytochrome P450 3A4
(Homo sapiens (Human))
BDBM50529958
(CHEMBL4472693)
Show SMILES [#6]-[#6]-[#8]-[#6](=O)-[#7]-1-[#6]-[#6]\[#6](-[#6]-[#6]-1)=[#6]/C#Cc1cccc(Cl)c1
Show InChI InChI=1S/C17H18ClNO2/c1-2-21-17(20)19-11-9-14(10-12-19)5-3-6-15-7-4-8-16(18)13-15/h4-5,7-8,13H,2,9-12H2,1H3
Reactome pathway
n/an/a 1.28E+4n/an/an/an/an/an/a
Recordati S.p.A.
Curated by ChEMBL
Assay Description
Inhibition of recombinant human CYP3A4 using 7-benzyloxy-trifluoromethylcoumarin as substrate preincubated for 10 mins followed by substrate addition...
J Med Chem 62: 1246-1273 (2019)
Article DOI: 10.1021/acs.jmedchem.8b01226
Cytochrome P450 2D6
(Homo sapiens (Human))
BDBM50529958
(CHEMBL4472693)
Show SMILES [#6]-[#6]-[#8]-[#6](=O)-[#7]-1-[#6]-[#6]\[#6](-[#6]-[#6]-1)=[#6]/C#Cc1cccc(Cl)c1
Show InChI InChI=1S/C17H18ClNO2/c1-2-21-17(20)19-11-9-14(10-12-19)5-3-6-15-7-4-8-16(18)13-15/h4-5,7-8,13H,2,9-12H2,1H3
n/an/a>2.00E+4n/an/an/an/an/an/a
Recordati S.p.A.
Curated by ChEMBL
Assay Description
Inhibition of recombinant human CYP2D6 using 3-[2-(N,N-diethylamino)ethyl]-7-methoxy-4-methylcoumarin as substrate preincubated for 10 mins followed ...
J Med Chem 62: 1246-1273 (2019)
Article DOI: 10.1021/acs.jmedchem.8b01226