BDBM50535084 CHEMBL3546703
SMILES: CN(C)c1ccc(cn1)-c1cc2nccnc2c(OC[C@H]2CCCNC2)n1
InChI Key: InChIKey=FDZBZSBLRVVIGJ-AWEZNQCLSA-N
Data: 4 IC50
Activity Spreadsheet -- Enzyme Inhibition Constant Data from BindingDB
Found 4 hits for monomerid = 50535084
Trg + Lig
Ki
nM
ΔG°
kcal/mole
IC50
nM
Kd
nM
EC50/IC50
nM
koff
s-1
kon
M-1s-1
pHTemp
°C
Tyrosine-protein kinase SYK
(Homo sapiens (Human))
BDBM50535084
(CHEMBL3546703)
Show SMILES CN(C)c1ccc(cn1)-c1cc2nccnc2c(OC[C@H]2CCCNC2)n1
Show InChI InChI=1S/C20H24N6O/c1-26(2)18-6-5-15(12-24-18)16-10-17-19(23-9-8-22-17)20(25-16)27-13-14-4-3-7-21-11-14/h5-6,8-10,12,14,21H,3-4,7,11,13H2,1-2H3/t14-/m0/s1
NCI pathway
Reactome pathway
n/an/a 126n/an/an/an/an/an/a
GlaxoSmithKline R&D
Curated by ChEMBL
Assay Description
Inhibition of SYK in human B cells assessed as suppression of anti-IgM-induced CD69 surface expression preincubated for 30 mins followed by anti-IgM ...
Bioorg Med Chem Lett 26: 4606-4612 (2016)
Article DOI: 10.1016/j.bmcl.2016.08.070
1,3-beta-glucan synthase component GLS2
(Saccharomyces cerevisiae)
BDBM50535084
(CHEMBL3546703)
Show SMILES CN(C)c1ccc(cn1)-c1cc2nccnc2c(OC[C@H]2CCCNC2)n1
Show InChI InChI=1S/C20H24N6O/c1-26(2)18-6-5-15(12-24-18)16-10-17-19(23-9-8-22-17)20(25-16)27-13-14-4-3-7-21-11-14/h5-6,8-10,12,14,21H,3-4,7,11,13H2,1-2H3/t14-/m0/s1
n/an/a 1.00E+4n/an/an/an/an/an/a
GlaxoSmithKline R&D
Curated by ChEMBL
Assay Description
Inhibition of human ERG expressed in CHOK1 cell membranes after 2 hrs by cy3b-dofetilide-based fluorescence polarization assay
Bioorg Med Chem Lett 26: 4606-4612 (2016)
Article DOI: 10.1016/j.bmcl.2016.08.070
Aurora kinase B
(Homo sapiens (Human))
BDBM50535084
(CHEMBL3546703)
Show SMILES CN(C)c1ccc(cn1)-c1cc2nccnc2c(OC[C@H]2CCCNC2)n1
Show InChI InChI=1S/C20H24N6O/c1-26(2)18-6-5-15(12-24-18)16-10-17-19(23-9-8-22-17)20(25-16)27-13-14-4-3-7-21-11-14/h5-6,8-10,12,14,21H,3-4,7,11,13H2,1-2H3/t14-/m0/s1
Reactome pathway
n/an/a 63n/an/an/an/an/an/a
GlaxoSmithKline R&D
Curated by ChEMBL
Assay Description
Inhibition of N-terminal-6His-tagged full length human Aurora B expressed in baculovirus using 5FAM-PKA-tide as substrate after 120 mins by fluoresce...
Bioorg Med Chem Lett 26: 4606-4612 (2016)
Article DOI: 10.1016/j.bmcl.2016.08.070
Tyrosine-protein kinase SYK
(Homo sapiens (Human))
BDBM50535084
(CHEMBL3546703)
Show SMILES CN(C)c1ccc(cn1)-c1cc2nccnc2c(OC[C@H]2CCCNC2)n1
Show InChI InChI=1S/C20H24N6O/c1-26(2)18-6-5-15(12-24-18)16-10-17-19(23-9-8-22-17)20(25-16)27-13-14-4-3-7-21-11-14/h5-6,8-10,12,14,21H,3-4,7,11,13H2,1-2H3/t14-/m0/s1
NCI pathway
Reactome pathway
n/an/a 4n/an/an/an/an/an/a
GlaxoSmithKline R&D
Curated by ChEMBL
Assay Description
Inhibition of N-terminal 6His-tagged full length human recombinant SYK expressed in baculovirus using Biotin-AAAEEIYGEI as substrate after 60 mins by...
Bioorg Med Chem Lett 26: 4606-4612 (2016)
Article DOI: 10.1016/j.bmcl.2016.08.070