BDBM50535112 CHEMBL4439328
SMILES: Cn1cc(cn1)-c1cc2nccnc2c(NC[C@@H]2CNCCC2(F)F)n1
InChI Key: InChIKey=KNGBPOUPNSUJPG-LBPRGKRZSA-N
Data: 4 IC50
Activity Spreadsheet -- Enzyme Inhibition Constant Data from BindingDB
Found 4 hits for monomerid = 50535112
Trg + Lig
Ki
nM
ΔG°
kcal/mole
IC50
nM
Kd
nM
EC50/IC50
nM
koff
s-1
kon
M-1s-1
pHTemp
°C
Tyrosine-protein kinase SYK
(Homo sapiens (Human))
BDBM50535112
(CHEMBL4439328)
Show SMILES Cn1cc(cn1)-c1cc2nccnc2c(NC[C@@H]2CNCCC2(F)F)n1 |r|
Show InChI InChI=1S/C17H19F2N7/c1-26-10-11(7-24-26)13-6-14-15(22-5-4-21-14)16(25-13)23-9-12-8-20-3-2-17(12,18)19/h4-7,10,12,20H,2-3,8-9H2,1H3,(H,23,25)/t12-/m0/s1
NCI pathway
Reactome pathway
n/an/a 4n/an/an/an/an/an/a
GlaxoSmithKline R&D
Curated by ChEMBL
Assay Description
Inhibition of N-terminal 6His-tagged full length human recombinant SYK expressed in baculovirus using Biotin-AAAEEIYGEI as substrate after 60 mins by...
Bioorg Med Chem Lett 26: 4606-4612 (2016)
Article DOI: 10.1016/j.bmcl.2016.08.070
1,3-beta-glucan synthase component GLS2
(Saccharomyces cerevisiae)
BDBM50535112
(CHEMBL4439328)
Show SMILES Cn1cc(cn1)-c1cc2nccnc2c(NC[C@@H]2CNCCC2(F)F)n1 |r|
Show InChI InChI=1S/C17H19F2N7/c1-26-10-11(7-24-26)13-6-14-15(22-5-4-21-14)16(25-13)23-9-12-8-20-3-2-17(12,18)19/h4-7,10,12,20H,2-3,8-9H2,1H3,(H,23,25)/t12-/m0/s1
n/an/a 2.51E+4n/an/an/an/an/an/a
GlaxoSmithKline R&D
Curated by ChEMBL
Assay Description
Inhibition of human ERG expressed in CHOK1 cell membranes after 2 hrs by cy3b-dofetilide-based fluorescence polarization assay
Bioorg Med Chem Lett 26: 4606-4612 (2016)
Article DOI: 10.1016/j.bmcl.2016.08.070
Tyrosine-protein kinase SYK
(Homo sapiens (Human))
BDBM50535112
(CHEMBL4439328)
Show SMILES Cn1cc(cn1)-c1cc2nccnc2c(NC[C@@H]2CNCCC2(F)F)n1 |r|
Show InChI InChI=1S/C17H19F2N7/c1-26-10-11(7-24-26)13-6-14-15(22-5-4-21-14)16(25-13)23-9-12-8-20-3-2-17(12,18)19/h4-7,10,12,20H,2-3,8-9H2,1H3,(H,23,25)/t12-/m0/s1
NCI pathway
Reactome pathway
n/an/a 79n/an/an/an/an/an/a
GlaxoSmithKline R&D
Curated by ChEMBL
Assay Description
Inhibition of SYK in human B cells assessed as suppression of anti-IgM-induced CD69 surface expression preincubated for 30 mins followed by anti-IgM ...
Bioorg Med Chem Lett 26: 4606-4612 (2016)
Article DOI: 10.1016/j.bmcl.2016.08.070
Aurora kinase B
(Homo sapiens (Human))
BDBM50535112
(CHEMBL4439328)
Show SMILES Cn1cc(cn1)-c1cc2nccnc2c(NC[C@@H]2CNCCC2(F)F)n1 |r|
Show InChI InChI=1S/C17H19F2N7/c1-26-10-11(7-24-26)13-6-14-15(22-5-4-21-14)16(25-13)23-9-12-8-20-3-2-17(12,18)19/h4-7,10,12,20H,2-3,8-9H2,1H3,(H,23,25)/t12-/m0/s1
Reactome pathway
n/an/a 63n/an/an/an/an/an/a
GlaxoSmithKline R&D
Curated by ChEMBL
Assay Description
Inhibition of N-terminal-6His-tagged full length human Aurora B expressed in baculovirus using 5FAM-PKA-tide as substrate after 120 mins by fluoresce...
Bioorg Med Chem Lett 26: 4606-4612 (2016)
Article DOI: 10.1016/j.bmcl.2016.08.070