BDBM50535494 CHEMBL4527085
SMILES: CC(C)(O)c1cnc(N)c2nc(ccc12)-c1ccnc(F)c1
InChI Key: InChIKey=XVUSMHCLFMFBQR-UHFFFAOYSA-N
Data: 3 IC50
PDB links: 1 PDB ID matches this monomer.
Activity Spreadsheet -- Enzyme Inhibition Constant Data from BindingDB
Found 3 hits for monomerid = 50535494
Trg + Lig
Ki
nM
ΔG°
kcal/mole
IC50
nM
Kd
nM
EC50/IC50
nM
koff
s-1
kon
M-1s-1
pHTemp
°C
Voltage-gated potassium channel subunit Kv7.1/Misshapen-like kinase 1
(Homo sapiens (Human))
BDBM50535494
(CHEMBL4527085)
Show SMILES CC(C)(O)c1cnc(N)c2nc(ccc12)-c1ccnc(F)c1
Show InChI InChI=1S/C16H15FN4O/c1-16(2,22)11-8-20-15(18)14-10(11)3-4-12(21-14)9-5-6-19-13(17)7-9/h3-8,22H,1-2H3,(H2,18,20)
n/an/a 200n/an/an/an/an/an/a
AstraZeneca
Curated by ChEMBL
Assay Description
Inhibition of human 6His-TEV-Avi-MINK1(1 to 328)-GNS expressed in baculovirus-infected sf21 cells using LRRKtide as substrate preincubated for 30 min...
Bioorg Med Chem Lett 29: 1962-1967 (2019)
Article DOI: 10.1016/j.bmcl.2019.05.032
3D
3D Structure (crystal)
TRAF2- and NCK-interacting kinase
(Homo sapiens (Human))
BDBM50535494
(CHEMBL4527085)
Show SMILES CC(C)(O)c1cnc(N)c2nc(ccc12)-c1ccnc(F)c1
Show InChI InChI=1S/C16H15FN4O/c1-16(2,22)11-8-20-15(18)14-10(11)3-4-12(21-14)9-5-6-19-13(17)7-9/h3-8,22H,1-2H3,(H2,18,20)
n/an/a 126n/an/an/an/an/an/a
AstraZeneca
Curated by ChEMBL
Assay Description
Inhibition of human 6His-TEV-TNIK(1 to 325) expressed in baculovirus-infected sf21 cells using LRRKtide as substrate preincubated for 30 mins followe...
Bioorg Med Chem Lett 29: 1962-1967 (2019)
Article DOI: 10.1016/j.bmcl.2019.05.032
3D
3D Structure (crystal)
Mitogen-activated protein kinase kinase kinase kinase 4
(Homo sapiens (Human))
BDBM50535494
(CHEMBL4527085)
Show SMILES CC(C)(O)c1cnc(N)c2nc(ccc12)-c1ccnc(F)c1
Show InChI InChI=1S/C16H15FN4O/c1-16(2,22)11-8-20-15(18)14-10(11)3-4-12(21-14)9-5-6-19-13(17)7-9/h3-8,22H,1-2H3,(H2,18,20)
NCI pathway
Reactome pathway
n/an/a 158n/an/an/an/an/an/a
AstraZeneca
Curated by ChEMBL
Assay Description
Inhibition of human 6His-TEV-SHM-MAP4K4(2 to 328)-GNS expressed in baculovirus-infected sf21 cells using LRRKtide as substrate preincubated for 30 mi...
Bioorg Med Chem Lett 29: 1962-1967 (2019)
Article DOI: 10.1016/j.bmcl.2019.05.032
3D
3D Structure (crystal)