null
SMILES: Fc1ccc(cc1F)[C@H]1OC(=O)N[C@@H]1c1cncc(c1)C#Cc1ccccc1
InChI Key: InChIKey=LRCGADNIJIRZLQ-NHCUHLMSSA-N
Activity Spreadsheet -- Enzyme Inhibition Constant Data from BindingDB
Found 3 hits for monomerid = 50536711
Trg + Lig
Ki
nM
ΔG°
kcal/mole
IC50
nM
Kd
nM
EC50/IC50
nM
koff
s-1
kon
M-1s-1
pHTemp
°C
Metabotropic glutamate receptor 5
(Homo sapiens (Human))
BDBM50536711
(CHEMBL4550190)
Show SMILES Fc1ccc(cc1F)[C@H]1OC(=O)N[C@@H]1c1cncc(c1)C#Cc1ccccc1 |r|
Show InChI InChI=1S/C22H14F2N2O2/c23-18-9-8-16(11-19(18)24)21-20(26-22(27)28-21)17-10-15(12-25-13-17)7-6-14-4-2-1-3-5-14/h1-5,8-13,20-21H,(H,26,27)/t20-,21-/m1/s1
2.80n/an/an/an/an/an/an/an/a
Bristol-Myers Squibb Research & Development
Curated by ChEMBL
Assay Description
Displacement of [3H]-MPEPy from human mGluR5A transfected in HEK293 cell membranes after 60 mins by microbeta liquid scintillation counting analysis
Bioorg Med Chem Lett 26: 4165-9 (2016)
Article DOI: 10.1016/j.bmcl.2016.07.065
Metabotropic glutamate receptor 5
(Homo sapiens (Human))
BDBM50536711
(CHEMBL4550190)
Show SMILES Fc1ccc(cc1F)[C@H]1OC(=O)N[C@@H]1c1cncc(c1)C#Cc1ccccc1 |r|
Show InChI InChI=1S/C22H14F2N2O2/c23-18-9-8-16(11-19(18)24)21-20(26-22(27)28-21)17-10-15(12-25-13-17)7-6-14-4-2-1-3-5-14/h1-5,8-13,20-21H,(H,26,27)/t20-,21-/m1/s1
n/an/an/an/a 0.200n/an/an/an/a
Bristol-Myers Squibb Research & Development
Curated by ChEMBL
Assay Description
Positive allosteric modulation of human mGluR5A transfected in HEK293 cells assessed as potentiation of L-glutamate-induced calcium release incubated...
Bioorg Med Chem Lett 26: 4165-9 (2016)
Article DOI: 10.1016/j.bmcl.2016.07.065
Metabotropic glutamate receptor 5
(Homo sapiens (Human))
BDBM50536711
(CHEMBL4550190)
Show SMILES Fc1ccc(cc1F)[C@H]1OC(=O)N[C@@H]1c1cncc(c1)C#Cc1ccccc1 |r|
Show InChI InChI=1S/C22H14F2N2O2/c23-18-9-8-16(11-19(18)24)21-20(26-22(27)28-21)17-10-15(12-25-13-17)7-6-14-4-2-1-3-5-14/h1-5,8-13,20-21H,(H,26,27)/t20-,21-/m1/s1
n/an/an/an/a 50n/an/an/an/a
Bristol-Myers Squibb Research & Development
Curated by ChEMBL
Assay Description
Agonist activity at human mGluR5A transfected in HEK293 cells assessed as induction of calcium release by FLIPR assay
Bioorg Med Chem Lett 26: 4165-9 (2016)
Article DOI: 10.1016/j.bmcl.2016.07.065