BDBM50538170 CHEMBL4640135
SMILES: CC(C)C[C@H](NC(=O)[C@H](Cc1cccc2ccccc12)NC(=O)[C@@H]1CCCN1C(=O)CNC(C)=O)C(=O)[C@@]1(C)CO1
InChI Key: InChIKey=YNUWLOXAGOJFMR-WJQRCLFPSA-N
Data: 1 IC50
Activity Spreadsheet -- Enzyme Inhibition Constant Data from BindingDB
Found 1 hit for monomerid = 50538170
Trg + Lig
Ki
nM
ΔG°
kcal/mole
IC50
nM
Kd
nM
EC50/IC50
nM
koff
s-1
kon
M-1s-1
pHTemp
°C
Proteasome subunit beta type-9
(Homo sapiens (Human))
BDBM50538170
(CHEMBL4640135)
Show SMILES CC(C)C[C@H](NC(=O)[C@H](Cc1cccc2ccccc12)NC(=O)[C@@H]1CCCN1C(=O)CNC(C)=O)C(=O)[C@@]1(C)CO1 |r|
Show InChI InChI=1S/C31H40N4O6/c1-19(2)15-24(28(38)31(4)18-41-31)33-29(39)25(16-22-11-7-10-21-9-5-6-12-23(21)22)34-30(40)26-13-8-14-35(26)27(37)17-32-20(3)36/h5-7,9-12,19,24-26H,8,13-18H2,1-4H3,(H,32,36)(H,33,39)(H,34,40)/t24-,25-,26-,31+/m0/s1
n/an/a 30n/an/an/an/an/an/a
University of Kentucky
Curated by ChEMBL
Assay Description
Inhibition of LMP2 in human 20S immunoproteasome using Ac-PAL-AMC as substrate after 1 hr by fluorescence based microplate reader analysis
J Med Chem 63: 3763-3783 (2020)