BDBM50540640 CHEMBL4641768
SMILES: CCCc1cn(CCCc2ccc(OCC3CCNCC3)cc2)c(n1)-c1cc2sccc2n1C
InChI Key: InChIKey=WRYWQFXVWLHBFW-UHFFFAOYSA-N
Data: 1 IC50
Activity Spreadsheet -- Enzyme Inhibition Constant Data from BindingDB
Found 1 hit for monomerid = 50540640
Trg + Lig
Ki
nM
ΔG°
kcal/mole
IC50
nM
Kd
nM
EC50/IC50
nM
koff
s-1
kon
M-1s-1
pHTemp
°C
Lysine-specific histone demethylase 1A
(Homo sapiens (Human))
BDBM50540640
(CHEMBL4641768)
Show SMILES CCCc1cn(CCCc2ccc(OCC3CCNCC3)cc2)c(n1)-c1cc2sccc2n1C
Show InChI InChI=1S/C28H36N4OS/c1-3-5-23-19-32(28(30-23)26-18-27-25(31(26)2)13-17-34-27)16-4-6-21-7-9-24(10-8-21)33-20-22-11-14-29-15-12-22/h7-10,13,17-19,22,29H,3-6,11-12,14-16,20H2,1-2H3
Reactome pathway
n/an/a 0.140n/an/an/an/an/an/a
European Institute of Oncology IRCCS
Curated by ChEMBL
Assay Description
Inhibition of recombinant human LSD1 expressed in Escherichia coli using biotinylated H3K4me as substrate by TR-FRET assay
ACS Med Chem Lett 11: 754-759 (2020)