BDBM50543738 CHEMBL4644215
SMILES: CCCCCc1cc(OC)cc(OCCCCCCCCCCC(=O)NC2CC2)c1
InChI Key: InChIKey=IGGCLPHXCBCRCJ-UHFFFAOYSA-N
Data: 2 KI  2 EC50
Activity Spreadsheet -- Enzyme Inhibition Constant Data from BindingDB
Found 4 hits for monomerid = 50543738
Trg + Lig
Ki
nM
ΔG°
kcal/mole
IC50
nM
Kd
nM
EC50/IC50
nM
koff
s-1
kon
M-1s-1
pHTemp
°C
Cannabinoid receptor 2
(Homo sapiens (Human))
BDBM50543738
(CHEMBL4644215)
Show SMILES CCCCCc1cc(OC)cc(OCCCCCCCCCCC(=O)NC2CC2)c1
Show InChI InChI=1S/C26H43NO3/c1-3-4-11-14-22-19-24(29-2)21-25(20-22)30-18-13-10-8-6-5-7-9-12-15-26(28)27-23-16-17-23/h19-21,23H,3-18H2,1-2H3,(H,27,28)
Reactome pathway
1.20n/an/an/an/an/an/an/an/a
Universit£ degli Studi di Siena
Curated by ChEMBL
Assay Description
Displacement of [3H]-CP55940 from human recombinant CB2 receptor expressed in HEK cell membrane
Bioorg Med Chem 28: (2020)
Cannabinoid receptor 1
(Homo sapiens (Human))
BDBM50543738
(CHEMBL4644215)
Show SMILES CCCCCc1cc(OC)cc(OCCCCCCCCCCC(=O)NC2CC2)c1
Show InChI InChI=1S/C26H43NO3/c1-3-4-11-14-22-19-24(29-2)21-25(20-22)30-18-13-10-8-6-5-7-9-12-15-26(28)27-23-16-17-23/h19-21,23H,3-18H2,1-2H3,(H,27,28)
NCI pathway
Reactome pathway
3.5n/an/an/an/an/an/an/an/a
Universit£ degli Studi di Siena
Curated by ChEMBL
Assay Description
Displacement of [3H]-CP55940 from human recombinant CB1 receptor expressed in HEK cell membrane
Bioorg Med Chem 28: (2020)
Cannabinoid receptor 2
(Homo sapiens (Human))
BDBM50543738
(CHEMBL4644215)
Show SMILES CCCCCc1cc(OC)cc(OCCCCCCCCCCC(=O)NC2CC2)c1
Show InChI InChI=1S/C26H43NO3/c1-3-4-11-14-22-19-24(29-2)21-25(20-22)30-18-13-10-8-6-5-7-9-12-15-26(28)27-23-16-17-23/h19-21,23H,3-18H2,1-2H3,(H,27,28)
Reactome pathway
n/an/an/an/a 398n/an/an/an/a
Universit£ degli Studi di Siena
Curated by ChEMBL
Assay Description
Agonist activity at human CB2 receptor expressed in CHO cell membrane assessed as inhibition of [35S]-GTPgammaS binding incubated for 1 hr by by liqu...
Bioorg Med Chem 28: (2020)
Cannabinoid receptor 1
(Homo sapiens (Human))
BDBM50543738
(CHEMBL4644215)
Show SMILES CCCCCc1cc(OC)cc(OCCCCCCCCCCC(=O)NC2CC2)c1
Show InChI InChI=1S/C26H43NO3/c1-3-4-11-14-22-19-24(29-2)21-25(20-22)30-18-13-10-8-6-5-7-9-12-15-26(28)27-23-16-17-23/h19-21,23H,3-18H2,1-2H3,(H,27,28)
NCI pathway
Reactome pathway
n/an/an/an/a 6.20n/an/an/an/a
Universit£ degli Studi di Siena
Curated by ChEMBL
Assay Description
Agonist activity at human CB1 receptor expressed in CHO cell membrane assessed as stimulation of [35S]-GTPgammaS binding incubated for 1 hr by by liq...
Bioorg Med Chem 28: (2020)