BDBM50544266 CHEMBL4649146
SMILES: CCN(CC)CCNc1cc2nc3\C(CCn3c(=O)c2cc1F)=C\c1ccc(CC(C)C)cc1
InChI Key: InChIKey=DNROIHHTORRBGS-CJLVFECKSA-N
Data: 1 IC50
Activity Spreadsheet -- Enzyme Inhibition Constant Data from BindingDB
Found 1 hit for monomerid = 50544266
Trg + Lig
Ki
nM
ΔG°
kcal/mole
IC50
nM
Kd
nM
EC50/IC50
nM
koff
s-1
kon
M-1s-1
pHTemp
°C
Bloom syndrome protein
(Homo sapiens (Human))
BDBM50544266
(CHEMBL4649146)
Show SMILES CCN(CC)CCNc1cc2nc3\C(CCn3c(=O)c2cc1F)=C\c1ccc(CC(C)C)cc1
Show InChI InChI=1S/C28H35FN4O/c1-5-32(6-2)14-12-30-26-18-25-23(17-24(26)29)28(34)33-13-11-22(27(33)31-25)16-21-9-7-20(8-10-21)15-19(3)4/h7-10,16-19,30H,5-6,11-15H2,1-4H3/b22-16+
Reactome pathway
n/an/a 3.10E+3n/an/an/an/an/an/a
Sun Yat-sen University
Curated by ChEMBL
Assay Description
Inhibition of His-tagged BLM (642 to 1296 residues) (unknown origin) expressed in Escherichia coli BL21 (DE3) cells assessed as reduction in DNA unwi...
J Med Chem 63: 9752-9772 (2020)