null
SMILES: CC(C)C[C@H](NC(=O)[C@H](C)NC(=O)[C@@H]1CCCN1C(C)=O)B(O)O
InChI Key:
Activity Spreadsheet -- Enzyme Inhibition Constant Data from BindingDB
Found 6 hits for monomerid = 50550641
Trg + Lig
Ki
nM
ΔG°
kcal/mole
IC50
nM
Kd
nM
EC50/IC50
nM
koff
s-1
kon
M-1s-1
pHTemp
°C
Proteasome subunit beta type-1
(Homo sapiens (Human))
BDBM50550641
(CHEMBL4781914)
Show SMILES CC(C)C[C@H](NC(=O)[C@H](C)NC(=O)[C@@H]1CCCN1C(C)=O)B(O)O |r|
Reactome pathway
n/an/a 320n/an/an/an/an/an/a
TBA
Citation and Details
Proteasome subunit beta type-2
(Homo sapiens (Human))
BDBM50550641
(CHEMBL4781914)
Show SMILES CC(C)C[C@H](NC(=O)[C@H](C)NC(=O)[C@@H]1CCCN1C(C)=O)B(O)O |r|
Reactome pathway
n/an/a>1.00E+4n/an/an/an/an/an/a
TBA
Citation and Details
Proteasome subunit beta type-8
(Homo sapiens (Human))
BDBM50550641
(CHEMBL4781914)
Show SMILES CC(C)C[C@H](NC(=O)[C@H](C)NC(=O)[C@@H]1CCCN1C(C)=O)B(O)O |r|
Reactome pathway
n/an/a 63n/an/an/an/an/an/a
TBA
Citation and Details
Proteasome subunit beta type-9
(Homo sapiens (Human))
BDBM50550641
(CHEMBL4781914)
Show SMILES CC(C)C[C@H](NC(=O)[C@H](C)NC(=O)[C@@H]1CCCN1C(C)=O)B(O)O |r|
n/an/a 13n/an/an/an/an/an/a
TBA
Citation and Details
Proteasome subunit beta type-10
(Homo sapiens (Human))
BDBM50550641
(CHEMBL4781914)
Show SMILES CC(C)C[C@H](NC(=O)[C@H](C)NC(=O)[C@@H]1CCCN1C(C)=O)B(O)O |r|
n/an/a>1.00E+4n/an/an/an/an/an/a
TBA
Citation and Details
Proteasome subunit beta type-5
(Homo sapiens (Human))
BDBM50550641
(CHEMBL4781914)
Show SMILES CC(C)C[C@H](NC(=O)[C@H](C)NC(=O)[C@@H]1CCCN1C(C)=O)B(O)O |r|
Reactome pathway
n/an/a 97n/an/an/an/an/an/a
TBA
Citation and Details