null
SMILES:
InChI Key:
Activity Spreadsheet -- Enzyme Inhibition Constant Data from BindingDB
Found 1 hit for monomerid = 50554050
Trg + Lig
Ki
nM
ΔG°
kcal/mole
IC50
nM
Kd
nM
EC50/IC50
nM
koff
s-1
kon
M-1s-1
pHTemp
°C
Myeloperoxidase
(Homo sapiens (Human))
BDBM50554050
(CHEMBL4752248)
n/an/a 2.90n/an/an/an/an/an/a
TBA
Citation and Details