null
SMILES:
InChI Key:
Activity Spreadsheet -- Enzyme Inhibition Constant Data from BindingDB
Found 1 hit for monomerid = 50554057
Trg + Lig
Ki
nM
ΔG°
kcal/mole
IC50
nM
Kd
nM
EC50/IC50
nM
koff
s-1
kon
M-1s-1
pHTemp
°C
Myeloperoxidase
(Homo sapiens (Human))
BDBM50554057
(CHEMBL4740830)
n/an/a 5n/an/an/an/an/an/a
TBA
Citation and Details