null
SMILES:
InChI Key:
Activity Spreadsheet -- Enzyme Inhibition Constant Data from BindingDB
Found 4 hits for monomerid = 50554395
Trg + Lig
Ki
nM
ΔG°
kcal/mole
IC50
nM
Kd
nM
EC50/IC50
nM
koff
s-1
kon
M-1s-1
pHTemp
°C
Proteasome subunit beta type-8
(Homo sapiens (Human))
BDBM50554395
(CHEMBL4763116)
Reactome pathway
n/an/a 2.40n/an/an/an/an/an/a
TBA
Citation and Details
Proteasome subunit beta type-5
(Homo sapiens (Human))
BDBM50554395
(CHEMBL4763116)
Reactome pathway
n/an/a 3.03E+3n/an/an/an/an/an/a
TBA
Citation and Details
Proteasome subunit beta type-8
(Homo sapiens (Human))
BDBM50554395
(CHEMBL4763116)
Reactome pathway
n/an/a 24n/an/an/an/an/an/a
TBA
Citation and Details
Proteasome subunit beta type-5
(Homo sapiens (Human))
BDBM50554395
(CHEMBL4763116)
Reactome pathway
n/an/a 5.52E+3n/an/an/an/an/an/a
TBA
Citation and Details