null
SMILES: Cc1cnc(s1)-c1cnc(Nc2cnc(cn2)C#N)cc1NC[C@H]1CNCCO1
InChI Key:
Activity Spreadsheet -- Enzyme Inhibition Constant Data from BindingDB
Found 3 hits for monomerid = 50555401
Trg + Lig
Ki
nM
ΔG°
kcal/mole
IC50
nM
Kd
nM
EC50/IC50
nM
koff
s-1
kon
M-1s-1
pHTemp
°C
Serine/threonine-protein kinase Chk1
(Homo sapiens (Human))
BDBM50555401
(CHEMBL4742233)
Show SMILES Cc1cnc(s1)-c1cnc(Nc2cnc(cn2)C#N)cc1NC[C@H]1CNCCO1 |r|
Reactome pathway
n/an/a 0.5n/an/an/an/an/an/a
TBA
Citation and Details
1,3-beta-glucan synthase component GSC2
(Saccharomyces cerevisiae)
BDBM50555401
(CHEMBL4742233)
Show SMILES Cc1cnc(s1)-c1cnc(Nc2cnc(cn2)C#N)cc1NC[C@H]1CNCCO1 |r|
n/an/a 5.60E+4n/an/an/an/an/an/a
TBA
Citation and Details
Serine/threonine-protein kinase Chk1
(Homo sapiens (Human))
BDBM50555401
(CHEMBL4742233)
Show SMILES Cc1cnc(s1)-c1cnc(Nc2cnc(cn2)C#N)cc1NC[C@H]1CNCCO1 |r|
Reactome pathway
n/an/a 13n/an/an/an/an/an/a
TBA
Citation and Details