null
SMILES:
InChI Key:
Activity Spreadsheet -- Enzyme Inhibition Constant Data from BindingDB
Found 8 hits for monomerid = 50555722
Trg + Lig
Ki
nM
ΔG°
kcal/mole
IC50
nM
Kd
nM
EC50/IC50
nM
koff
s-1
kon
M-1s-1
pHTemp
°C
Carbonic anhydrase
(Homo sapiens (Human))
BDBM50555722
(CHEMBL4793920)
Reactome pathway
0.263n/an/an/an/an/an/an/an/a
TBA
Citation and Details
Adenosine receptor A2a
(Homo sapiens (Human))
BDBM50555722
(CHEMBL4793920)
NCI pathway
Reactome pathway
11n/an/an/an/an/an/an/an/a
TBA
Citation and Details
Carbonic anhydrases; II & IX
(Homo sapiens (Human))
BDBM50555722
(CHEMBL4793920)
NCI pathway
Reactome pathway
109n/an/an/an/an/an/an/an/a
TBA
Citation and Details
Carbonic anhydrase 2
(Homo sapiens (Human))
BDBM50555722
(CHEMBL4793920)
Reactome pathway
527n/an/an/an/an/an/an/an/a
TBA
Citation and Details
Adenosine receptor A1
(Homo sapiens (Human))
BDBM50555722
(CHEMBL4793920)
Reactome pathway
1.03E+3n/an/an/an/an/an/an/an/a
TBA
Citation and Details
Adenosine receptor A3
(Homo sapiens (Human))
BDBM50555722
(CHEMBL4793920)
Reactome pathway
5.83E+3n/an/an/an/an/an/an/an/a
TBA
Citation and Details
Carbonic anhydrase
(Homo sapiens (Human))
BDBM50555722
(CHEMBL4793920)
NCI pathway
Reactome pathway
8.71E+3n/an/an/an/an/an/an/an/a
TBA
Citation and Details
Adenosine receptors; A2a & A2b
(Homo sapiens (Human))
BDBM50555722
(CHEMBL4793920)
NCI pathway
Reactome pathway
n/an/a>3.00E+4n/an/an/an/an/an/a
TBA
Citation and Details