null
SMILES: CC(C)(\C=C(/C#N)C(=O)N1CCC[C@H](C1)n1nc(-c2ccc(Oc3ccccc3)cc2F)c2c(N)ncnc12)N1CCN(CC1)C1COC1
InChI Key:
PDB links: 2 PDB IDs match this monomer.
Activity Spreadsheet -- Enzyme Inhibition Constant Data from BindingDB
Found 7 hits for monomerid = 50557485
Trg + Lig
Ki
nM
ΔG°
kcal/mole
IC50
nM
Kd
nM
EC50/IC50
nM
koff
s-1
kon
M-1s-1
pHTemp
°C
Tyrosine-protein kinase BTK
(Homo sapiens (Human))
BDBM50557485
(Prn-1008 | Prn1008 | Rilzabrutinib)
Show SMILES CC(C)(\C=C(/C#N)C(=O)N1CCC[C@H](C1)n1nc(-c2ccc(Oc3ccccc3)cc2F)c2c(N)ncnc12)N1CCN(CC1)C1COC1
NCI pathway
Reactome pathway
n/an/a 1.30n/an/an/an/an/an/a
TBA
Assay Description
Inhibition of BTK (unknown origin) One-hour enzymatic assay without pre-incubation
Citation and Details
Article DOI: 10.1016/j.bmcl.2021.127862
BindingDB Entry DOI: 10.7270/Q21V5JNK
3D
3D Structure (crystal)
Tyrosine-protein kinase BTK
(Homo sapiens (Human))
BDBM50557485
(Prn-1008 | Prn1008 | Rilzabrutinib)
Show SMILES CC(C)(\C=C(/C#N)C(=O)N1CCC[C@H](C1)n1nc(-c2ccc(Oc3ccccc3)cc2F)c2c(N)ncnc12)N1CCN(CC1)C1COC1
NCI pathway
Reactome pathway
n/an/a 1.30n/an/an/an/an/an/a
TBA
Citation and Details
Article DOI: 10.1021/acs.jmedchem.1c01170
BindingDB Entry DOI: 10.7270/Q2W099WG
3D
3D Structure (crystal)
Tyrosine-protein kinase BTK
(Homo sapiens (Human))
BDBM50557485
(Prn-1008 | Prn1008 | Rilzabrutinib)
Show SMILES CC(C)(\C=C(/C#N)C(=O)N1CCC[C@H](C1)n1nc(-c2ccc(Oc3ccccc3)cc2F)c2c(N)ncnc12)N1CCN(CC1)C1COC1
NCI pathway
Reactome pathway
n/an/a 1.30n/an/an/an/an/an/a
TBA
Citation and Details
Article DOI: 10.1021/acs.jmedchem.1c01170
BindingDB Entry DOI: 10.7270/Q2W099WG
3D
3D Structure (crystal)
Tyrosine-protein kinase Blk
(Homo sapiens (Human))
BDBM50557485
(Prn-1008 | Prn1008 | Rilzabrutinib)
Show SMILES CC(C)(\C=C(/C#N)C(=O)N1CCC[C@H](C1)n1nc(-c2ccc(Oc3ccccc3)cc2F)c2c(N)ncnc12)N1CCN(CC1)C1COC1
Reactome pathway
n/an/a 6.30n/an/an/an/an/an/a
TBA
Citation and Details
Article DOI: 10.1021/acs.jmedchem.1c01170
BindingDB Entry DOI: 10.7270/Q2W099WG
Tyrosine-protein kinase Tec
(Homo sapiens (Human))
BDBM50557485
(Prn-1008 | Prn1008 | Rilzabrutinib)
Show SMILES CC(C)(\C=C(/C#N)C(=O)N1CCC[C@H](C1)n1nc(-c2ccc(Oc3ccccc3)cc2F)c2c(N)ncnc12)N1CCN(CC1)C1COC1
Reactome pathway
n/an/a 0.800n/an/an/an/an/an/a
TBA
Citation and Details
Article DOI: 10.1021/acs.jmedchem.1c01170
BindingDB Entry DOI: 10.7270/Q2W099WG
Cytoplasmic tyrosine-protein kinase BMX
(Homo sapiens (Human))
BDBM50557485
(Prn-1008 | Prn1008 | Rilzabrutinib)
Show SMILES CC(C)(\C=C(/C#N)C(=O)N1CCC[C@H](C1)n1nc(-c2ccc(Oc3ccccc3)cc2F)c2c(N)ncnc12)N1CCN(CC1)C1COC1
NCI pathway
Reactome pathway
n/an/a 1n/an/an/an/an/an/a
TBA
Citation and Details
Article DOI: 10.1021/acs.jmedchem.1c01170
BindingDB Entry DOI: 10.7270/Q2W099WG
Tyrosine-protein kinase TXK
(Homo sapiens (Human))
BDBM50557485
(Prn-1008 | Prn1008 | Rilzabrutinib)
Show SMILES CC(C)(\C=C(/C#N)C(=O)N1CCC[C@H](C1)n1nc(-c2ccc(Oc3ccccc3)cc2F)c2c(N)ncnc12)N1CCN(CC1)C1COC1
n/an/a 1.20n/an/an/an/an/an/a
TBA
Citation and Details
Article DOI: 10.1021/acs.jmedchem.1c01170
BindingDB Entry DOI: 10.7270/Q2W099WG