null
SMILES: Nc1nc2sc(CCCCc3ccc(o3)C(=O)N[C@@H](CCC(O)=O)C(O)=O)cc2c(=O)[nH]1
InChI Key:
PDB links: 1 PDB ID matches this monomer.
Activity Spreadsheet -- Enzyme Inhibition Constant Data from BindingDB
Found 5 hits for monomerid = 50557567
Trg + Lig
Ki
nM
ΔG°
kcal/mole
IC50
nM
Kd
nM
EC50/IC50
nM
koff
s-1
kon
M-1s-1
pHTemp
°C
Bifunctional purine biosynthesis protein ATIC
(Homo sapiens (Human))
BDBM50557567
(CHEMBL4789686)
Show SMILES Nc1nc2sc(CCCCc3ccc(o3)C(=O)N[C@@H](CCC(O)=O)C(O)=O)cc2c(=O)[nH]1 |r|
Reactome pathway
2.47E+4n/an/an/an/an/an/an/an/a
TBA
Citation and Details
Folate receptor alpha
(Homo sapiens (Human))
BDBM50557567
(CHEMBL4789686)
Show SMILES Nc1nc2sc(CCCCc3ccc(o3)C(=O)N[C@@H](CCC(O)=O)C(O)=O)cc2c(=O)[nH]1 |r|
n/an/a 11n/an/an/an/an/an/a
TBA
Citation and Details
Proton-coupled folate transporter
(Homo sapiens (Human))
BDBM50557567
(CHEMBL4789686)
Show SMILES Nc1nc2sc(CCCCc3ccc(o3)C(=O)N[C@@H](CCC(O)=O)C(O)=O)cc2c(=O)[nH]1 |r|
Reactome pathway
n/an/a>1.00E+3n/an/an/an/an/an/a
TBA
Citation and Details
Reduced folate transporter
(Homo sapiens (Human))
BDBM50557567
(CHEMBL4789686)
Show SMILES Nc1nc2sc(CCCCc3ccc(o3)C(=O)N[C@@H](CCC(O)=O)C(O)=O)cc2c(=O)[nH]1 |r|
Reactome pathway
n/an/a>1.00E+3n/an/an/an/an/an/a
TBA
Citation and Details
Folate receptor beta
(Homo sapiens (Human))
BDBM50557567
(CHEMBL4789686)
Show SMILES Nc1nc2sc(CCCCc3ccc(o3)C(=O)N[C@@H](CCC(O)=O)C(O)=O)cc2c(=O)[nH]1 |r|
n/an/a 2.60n/an/an/an/an/an/a
TBA
Citation and Details