null
SMILES: COc1cc(F)c([C@@H]2CNC(=O)[C@H]2NC(=O)Nc2ccc(F)c(F)c2)c(F)c1
InChI Key:
Activity Spreadsheet -- Enzyme Inhibition Constant Data from BindingDB
Found 4 hits for monomerid = 50559835
Trg + Lig
Ki
nM
ΔG°
kcal/mole
IC50
nM
Kd
nM
EC50/IC50
nM
koff
s-1
kon
M-1s-1
pHTemp
°C
N-formyl peptide receptor 2
(Homo sapiens (Human))
BDBM50559835
(CHEMBL4762030)
Show SMILES COc1cc(F)c([C@@H]2CNC(=O)[C@H]2NC(=O)Nc2ccc(F)c(F)c2)c(F)c1 |r|
NCI pathway
Reactome pathway
n/an/an/an/a 0.160n/an/an/an/a
TBA
Citation and Details
Cytochrome P450 3A4
(Homo sapiens (Human))
BDBM50559835
(CHEMBL4762030)
Show SMILES COc1cc(F)c([C@@H]2CNC(=O)[C@H]2NC(=O)Nc2ccc(F)c(F)c2)c(F)c1 |r|
Reactome pathway
n/an/a>2.00E+4n/an/an/an/an/an/a
TBA
Citation and Details
Formyl peptide receptor 2
(Mus musculus)
BDBM50559835
(CHEMBL4762030)
Show SMILES COc1cc(F)c([C@@H]2CNC(=O)[C@H]2NC(=O)Nc2ccc(F)c(F)c2)c(F)c1 |r|
n/an/an/an/a 8.5n/an/an/an/a
TBA
Citation and Details
fMet-Leu-Phe receptor
(Homo sapiens (Human))
BDBM50559835
(CHEMBL4762030)
Show SMILES COc1cc(F)c([C@@H]2CNC(=O)[C@H]2NC(=O)Nc2ccc(F)c(F)c2)c(F)c1 |r|
Reactome pathway
n/an/an/an/a 820n/an/an/an/a
TBA
Citation and Details