null
SMILES:
InChI Key:
Activity Spreadsheet -- Enzyme Inhibition Constant Data from BindingDB
Found 2 hits for monomerid = 50559906
Trg + Lig
Ki
nM
ΔG°
kcal/mole
IC50
nM
Kd
nM
EC50/IC50
nM
koff
s-1
kon
M-1s-1
pHTemp
°C
Tyrosine-protein kinase BTK
(Homo sapiens (Human))
BDBM50559906
(CHEMBL4798086)
NCI pathway
Reactome pathway
n/an/an/an/a 7.20n/an/an/an/a
TBA
Citation and Details
Epidermal growth factor receptor
(Homo sapiens (Human))
BDBM50559906
(CHEMBL4798086)
n/an/a 11n/an/an/an/an/an/a
TBA
Citation and Details