null
SMILES: COc1ccc(OC)c2c1c(OC)cc1c2oc(cc1=O)-c1c[nH]c2ccccc12
InChI Key:
Activity Spreadsheet -- Enzyme Inhibition Constant Data from BindingDB
Found 3 hits for monomerid = 50562221
Trg + Lig
Ki
nM
ΔG°
kcal/mole
IC50
nM
Kd
nM
EC50/IC50
nM
koff
s-1
kon
M-1s-1
pHTemp
°C
Cytochrome P450 1A1
(Homo sapiens (Human))
BDBM50562221
(CHEMBL4753083)
Show SMILES COc1ccc(OC)c2c1c(OC)cc1c2oc(cc1=O)-c1c[nH]c2ccccc12
Reactome pathway
n/an/a 17n/an/an/an/an/an/a
TBA
Citation and Details
Cytochrome P450 1B1
(Homo sapiens (Human))
BDBM50562221
(CHEMBL4753083)
Show SMILES COc1ccc(OC)c2c1c(OC)cc1c2oc(cc1=O)-c1c[nH]c2ccccc12
Reactome pathway
n/an/a 4.10n/an/an/an/an/an/a
TBA
Citation and Details
Cytochrome P450 1A2
(Homo sapiens (Human))
BDBM50562221
(CHEMBL4753083)
Show SMILES COc1ccc(OC)c2c1c(OC)cc1c2oc(cc1=O)-c1c[nH]c2ccccc12
Reactome pathway
n/an/a>1.00E+3n/an/an/an/an/an/a
TBA
Citation and Details