null
SMILES:
InChI Key:
Activity Spreadsheet -- Enzyme Inhibition Constant Data from BindingDB
Found 3 hits for monomerid = 50562231
Trg + Lig
Ki
nM
ΔG°
kcal/mole
IC50
nM
Kd
nM
EC50/IC50
nM
koff
s-1
kon
M-1s-1
pHTemp
°C
Cytochrome P450 1B1
(Homo sapiens (Human))
BDBM50562231
(CHEMBL4750829)
Reactome pathway
n/an/a 1.10n/an/an/an/an/an/a
TBA
Citation and Details
Cytochrome P450 1A2
(Homo sapiens (Human))
BDBM50562231
(CHEMBL4750829)
Reactome pathway
n/an/a 742n/an/an/an/an/an/a
TBA
Citation and Details
Cytochrome P450 1A1
(Homo sapiens (Human))
BDBM50562231
(CHEMBL4750829)
Reactome pathway
n/an/a 8n/an/an/an/an/an/a
TBA
Citation and Details