null
SMILES: COc1ccc(OC)c2c1c(OC)cc1c2oc(cc1=O)-c1cccc(F)n1
InChI Key:
Activity Spreadsheet -- Enzyme Inhibition Constant Data from BindingDB
Found 3 hits for monomerid = 50562250
Trg + Lig
Ki
nM
ΔG°
kcal/mole
IC50
nM
Kd
nM
EC50/IC50
nM
koff
s-1
kon
M-1s-1
pHTemp
°C
Cytochrome P450 1B1
(Homo sapiens (Human))
BDBM50562250
(CHEMBL4799247)
Show SMILES COc1ccc(OC)c2c1c(OC)cc1c2oc(cc1=O)-c1cccc(F)n1
Reactome pathway
n/an/a 0.380n/an/an/an/an/an/a
TBA
Citation and Details
Cytochrome P450 1A2
(Homo sapiens (Human))
BDBM50562250
(CHEMBL4799247)
Show SMILES COc1ccc(OC)c2c1c(OC)cc1c2oc(cc1=O)-c1cccc(F)n1
Reactome pathway
n/an/a 668n/an/an/an/an/an/a
TBA
Citation and Details
Cytochrome P450 1A1
(Homo sapiens (Human))
BDBM50562250
(CHEMBL4799247)
Show SMILES COc1ccc(OC)c2c1c(OC)cc1c2oc(cc1=O)-c1cccc(F)n1
Reactome pathway
n/an/a 2.30n/an/an/an/an/an/a
TBA
Citation and Details