null
SMILES: O=C1c2nnn(Cc3ccccc3)c2C(=O)c2nnn(Cc3ccccc3)c12
InChI Key:
Activity Spreadsheet -- Enzyme Inhibition Constant Data from BindingDB
Found 2 hits for monomerid = 50562516
Trg + Lig
Ki
nM
ΔG°
kcal/mole
IC50
nM
Kd
nM
EC50/IC50
nM
koff
s-1
kon
M-1s-1
pHTemp
°C
Indoleamine 2,3-dioxygenase 1
(Homo sapiens (Human))
BDBM50562516
(CHEMBL4746602)
Show SMILES O=C1c2nnn(Cc3ccccc3)c2C(=O)c2nnn(Cc3ccccc3)c12
Reactome pathway
n/an/a 1n/an/an/an/an/an/a
TBA
Citation and Details
Indoleamine 2,3-dioxygenase 1
(Homo sapiens (Human))
BDBM50562516
(CHEMBL4746602)
Show SMILES O=C1c2nnn(Cc3ccccc3)c2C(=O)c2nnn(Cc3ccccc3)c12
Reactome pathway
n/an/a 1n/an/an/an/an/an/a
TBA
Citation and Details