null
SMILES: CC(Oc1nc2n(C)ncc2c(=O)n1-c1ccccc1)c1ccccc1
InChI Key:
Activity Spreadsheet -- Enzyme Inhibition Constant Data from BindingDB
Found 2 hits for monomerid = 50567368
Trg + Lig
Ki
nM
ΔG°
kcal/mole
IC50
nM
Kd
nM
EC50/IC50
nM
koff
s-1
kon
M-1s-1
pHTemp
°C
Aldehyde dehydrogenase family 1 member A3
(Homo sapiens (Human))
BDBM50567368
(CHEMBL4859854)
Show SMILES CC(Oc1nc2n(C)ncc2c(=O)n1-c1ccccc1)c1ccccc1
n/an/a 600n/an/an/an/an/an/a
TBA
Citation and Details
Aldehyde dehydrogenase 1A1
(Homo sapiens (Human))
BDBM50567368
(CHEMBL4859854)
Show SMILES CC(Oc1nc2n(C)ncc2c(=O)n1-c1ccccc1)c1ccccc1
Reactome pathway
n/an/a 2.40E+3n/an/an/an/an/an/a
TBA
Citation and Details