null
SMILES: CC(Sc1nc2n(C)ncc2c(=O)n1-c1ccc(cc1)C#C)c1ccccc1
InChI Key:
Activity Spreadsheet -- Enzyme Inhibition Constant Data from BindingDB
Found 2 hits for monomerid = 50567388
Trg + Lig
Ki
nM
ΔG°
kcal/mole
IC50
nM
Kd
nM
EC50/IC50
nM
koff
s-1
kon
M-1s-1
pHTemp
°C
Aldehyde dehydrogenase family 1 member A3
(Homo sapiens (Human))
BDBM50567388
(CHEMBL4877915)
Show SMILES CC(Sc1nc2n(C)ncc2c(=O)n1-c1ccc(cc1)C#C)c1ccccc1
n/an/a 520n/an/an/an/an/an/a
TBA
Assay Description
Inhibition of human ALDH1A3 assessed as NADH formation using propionaldehyde as substrate by spectrophotometery
Citation and Details
Article DOI: 10.1016/j.ejmech.2020.113060
BindingDB Entry DOI: 10.7270/Q2N58R5M
Retinal dehydrogenase 2
(Homo sapiens (Human))
BDBM50567388
(CHEMBL4877915)
Show SMILES CC(Sc1nc2n(C)ncc2c(=O)n1-c1ccc(cc1)C#C)c1ccccc1
n/an/a 800n/an/an/an/an/an/a
TBA
Assay Description
Inhibition of human ALDH1A2 assessed as NADH formation using propionaldehyde as substrate by spectrophotometery
Citation and Details
Article DOI: 10.1016/j.ejmech.2020.113060
BindingDB Entry DOI: 10.7270/Q2N58R5M