null
SMILES: Nc1ccc(cc1)-c1cnc2[nH]nc(C(=O)c3c(F)ccc(NS(=O)(=O)Cc4ccccc4)c3F)c2c1
InChI Key:
Activity Spreadsheet -- Enzyme Inhibition Constant Data from BindingDB
Found 6 hits for monomerid = 50567687
Trg + Lig
Ki
nM
ΔG°
kcal/mole
IC50
nM
Kd
nM
EC50/IC50
nM
koff
s-1
kon
M-1s-1
pHTemp
°C
Serine/threonine-protein kinase B-raf
(Homo sapiens (Human))
BDBM50567687
(CHEMBL4865410)
Show SMILES Nc1ccc(cc1)-c1cnc2[nH]nc(C(=O)c3c(F)ccc(NS(=O)(=O)Cc4ccccc4)c3F)c2c1
NCI pathway
Reactome pathway
n/an/an/a 610n/an/an/an/an/a
TBA
Citation and Details
Article DOI: 10.1016/j.ejmech.2021.113371
BindingDB Entry DOI: 10.7270/Q2ZG6X0K
Mitogen-activated protein kinase 8
(Homo sapiens (Human))
BDBM50567687
(CHEMBL4865410)
Show SMILES Nc1ccc(cc1)-c1cnc2[nH]nc(C(=O)c3c(F)ccc(NS(=O)(=O)Cc4ccccc4)c3F)c2c1
NCI pathway
Reactome pathway
n/an/an/a 140n/an/an/an/an/a
TBA
Citation and Details
Article DOI: 10.1016/j.ejmech.2021.113371
BindingDB Entry DOI: 10.7270/Q2ZG6X0K
Mitogen-activated protein kinase kinase kinase 20
(Homo sapiens (Human))
BDBM50567687
(CHEMBL4865410)
Show SMILES Nc1ccc(cc1)-c1cnc2[nH]nc(C(=O)c3c(F)ccc(NS(=O)(=O)Cc4ccccc4)c3F)c2c1
NCI pathway
n/an/an/a 9.5n/an/an/an/an/a
TBA
Citation and Details
Article DOI: 10.1016/j.ejmech.2021.113371
BindingDB Entry DOI: 10.7270/Q2ZG6X0K
Dual specificity mitogen-activated protein kinase kinase 4
(Homo sapiens (Human))
BDBM50567687
(CHEMBL4865410)
Show SMILES Nc1ccc(cc1)-c1cnc2[nH]nc(C(=O)c3c(F)ccc(NS(=O)(=O)Cc4ccccc4)c3F)c2c1
NCI pathway
Reactome pathway
n/an/an/a 1.5n/an/an/an/an/a
TBA
Citation and Details
Article DOI: 10.1016/j.ejmech.2021.113371
BindingDB Entry DOI: 10.7270/Q2ZG6X0K
Dual specificity mitogen-activated protein kinase kinase 7
(Homo sapiens (Human))
BDBM50567687
(CHEMBL4865410)
Show SMILES Nc1ccc(cc1)-c1cnc2[nH]nc(C(=O)c3c(F)ccc(NS(=O)(=O)Cc4ccccc4)c3F)c2c1
n/an/an/a 5.00E+3n/an/an/an/an/a
TBA
Citation and Details
Article DOI: 10.1016/j.ejmech.2021.113371
BindingDB Entry DOI: 10.7270/Q2ZG6X0K
Mitogen-activated protein kinase kinase kinase kinase 5
(Homo sapiens (Human))
BDBM50567687
(CHEMBL4865410)
Show SMILES Nc1ccc(cc1)-c1cnc2[nH]nc(C(=O)c3c(F)ccc(NS(=O)(=O)Cc4ccccc4)c3F)c2c1
NCI pathway
n/an/an/a 5.80n/an/an/an/an/a
TBA
Citation and Details
Article DOI: 10.1016/j.ejmech.2021.113371
BindingDB Entry DOI: 10.7270/Q2ZG6X0K