null
SMILES: COc1cc2CCN(C)Cc2cc1Nc1ncc(C(N)=O)c(Nc2ccccc2N2CCOC2=O)n1
InChI Key:
Activity Spreadsheet -- Enzyme Inhibition Constant Data from BindingDB
Found 1 hit for monomerid = 50569668
Trg + Lig
Ki
nM
ΔG°
kcal/mole
IC50
nM
Kd
nM
EC50/IC50
nM
koff
s-1
kon
M-1s-1
pHTemp
°C
Mitogen-activated protein kinase kinase kinase kinase 1
(Homo sapiens (Human))
BDBM50569668
(CHEMBL4857184)
Show SMILES COc1cc2CCN(C)Cc2cc1Nc1ncc(C(N)=O)c(Nc2ccccc2N2CCOC2=O)n1
NCI pathway
n/an/a 0.220n/an/an/an/an/an/a
TBA
Citation and Details