null
SMILES: COc1cc(ccc1Nc1ncc2c(C)cc(=O)n([C@@H]3CC[C@@H](CC3)NCC3CC3)c2n1)N1CCN(C)CC1
InChI Key:
Activity Spreadsheet -- Enzyme Inhibition Constant Data from BindingDB
Found 1 hit for monomerid = 50569983
Trg + Lig
Ki
nM
ΔG°
kcal/mole
IC50
nM
Kd
nM
EC50/IC50
nM
koff
s-1
kon
M-1s-1
pHTemp
°C
Dual specificity protein kinase TTK
(Homo sapiens (Human))
BDBM50569983
(CHEMBL4870731)
Show SMILES COc1cc(ccc1Nc1ncc2c(C)cc(=O)n([C@@H]3CC[C@@H](CC3)NCC3CC3)c2n1)N1CCN(C)CC1 |r,wU:22.26,19.19,(9.04,-26.26,;10.37,-25.49,;10.35,-23.95,;9.01,-23.18,;9,-21.64,;10.33,-20.86,;11.67,-21.62,;11.68,-23.16,;13.02,-23.93,;14.35,-23.14,;14.34,-21.6,;15.66,-20.82,;17.01,-21.58,;18.34,-20.8,;18.32,-19.26,;19.67,-21.57,;19.68,-23.11,;21.03,-23.87,;18.35,-23.89,;18.37,-25.43,;17.04,-26.2,;17.05,-27.74,;18.39,-28.51,;19.71,-27.73,;19.71,-26.19,;18.39,-30.05,;19.74,-30.81,;19.75,-32.35,;20.52,-33.68,;18.98,-33.69,;17.02,-23.12,;15.69,-23.91,;7.66,-20.88,;6.33,-21.65,;4.99,-20.9,;4.99,-19.36,;3.64,-18.59,;6.32,-18.57,;7.65,-19.34,)|
n/an/an/a 6.10n/an/an/an/an/a
TBA
Assay Description
Binding affinity to wild-type human partial length TTK (N505 to V798 residues) expressed in bacterial expression system by active site-directed compe...
Citation and Details
Article DOI: 10.1016/j.ejmech.2020.113023
BindingDB Entry DOI: 10.7270/Q2GM8C33