null
SMILES: CCN(CC)CC.CCN(CC)CC.Cc1cn([C@@H]2O[C@H](COP(O)(=O)CP(O)(O)=O)[C@@H](O)[C@H]2O)c(=O)[nH]\c1=N/OCc1ccccc1
InChI Key:
Activity Spreadsheet -- Enzyme Inhibition Constant Data from BindingDB
Found 2 hits for monomerid = 50571223
Trg + Lig
Ki
nM
ΔG°
kcal/mole
IC50
nM
Kd
nM
EC50/IC50
nM
koff
s-1
kon
M-1s-1
pHTemp
°C
5'-nucleotidase
(Rattus norvegicus (Rat))
BDBM50571223
(CHEMBL4875403)
Show SMILES CCN(CC)CC.CCN(CC)CC.Cc1cn([C@@H]2O[C@H](COP(O)(=O)CP(O)(O)=O)[C@@H](O)[C@H]2O)c(=O)[nH]\c1=N/OCc1ccccc1 |r|
n/an/a 321n/an/an/an/an/an/a
TBA
Citation and Details
P2Y purinoceptor 6
(Homo sapiens (Human))
BDBM50571223
(CHEMBL4875403)
Show SMILES CCN(CC)CC.CCN(CC)CC.Cc1cn([C@@H]2O[C@H](COP(O)(=O)CP(O)(O)=O)[C@@H](O)[C@H]2O)c(=O)[nH]\c1=N/OCc1ccccc1 |r|
Reactome pathway
n/an/an/an/a 1.09E+3n/an/an/an/a
TBA
Citation and Details