null
SMILES: O=C1CCC(=O)N1OS(=O)(=O)c1ccccc1
InChI Key:
Activity Spreadsheet -- Enzyme Inhibition Constant Data from BindingDB
Found 2 hits for monomerid = 50572957
Trg + Lig
Ki
nM
ΔG°
kcal/mole
IC50
nM
Kd
nM
EC50/IC50
nM
koff
s-1
kon
M-1s-1
pHTemp
°C
Presenilins-associated rhomboid-like protein, mitochondrial
(Homo sapiens)
BDBM50572957
(CHEMBL4871112)
Show SMILES O=C1CCC(=O)N1OS(=O)(=O)c1ccccc1
NCI pathway
Reactome pathway
n/an/a 2.00E+4n/an/an/an/an/an/a
TBA
Assay Description
Inhibition of human PARL transfected in HEK293T cell membrane assessed as inhibition of FP-Rh labeling treated with compound for 30 mins prior to FP-...
Citation and Details
Article DOI: 10.1016/j.bmcl.2021.128290
BindingDB Entry DOI: 10.7270/Q2FR01D1
Rhomboid protease GlpG
(Escherichia coli (Enterobacteria))
BDBM50572957
(CHEMBL4871112)
Show SMILES O=C1CCC(=O)N1OS(=O)(=O)c1ccccc1
n/an/a 1.20E+5n/an/an/an/an/an/a
TBA
Assay Description
Inhibition of GlpG in Escherichia coli BL21 assessed as inhibition of FP-Rh labeling treated with compound for 30 mins prior to FP-Rh addition by com...
Citation and Details
Article DOI: 10.1016/j.bmcl.2021.128290
BindingDB Entry DOI: 10.7270/Q2FR01D1