null
SMILES: [H][C@@]12CCCN1C(=O)CNC(=O)CCCCCOC[C@H](NC2=O)C(=O)N[C@@H](CC(C)C)C(=O)[C@@]1(C)CO1
InChI Key:
Activity Spreadsheet -- Enzyme Inhibition Constant Data from BindingDB
Found 4 hits for monomerid = 50573702
Trg + Lig
Ki
nM
ΔG°
kcal/mole
IC50
nM
Kd
nM
EC50/IC50
nM
koff
s-1
kon
M-1s-1
pHTemp
°C
Proteasome subunit beta type-9
(Homo sapiens (Human))
BDBM50573702
(CHEMBL4867229)
Show SMILES [H][C@@]12CCCN1C(=O)CNC(=O)CCCCCOC[C@H](NC2=O)C(=O)N[C@@H](CC(C)C)C(=O)[C@@]1(C)CO1 |r|
n/an/a 69n/an/an/an/an/an/a
TBA
Citation and Details
Proteasome subunit beta type-9
(Homo sapiens (Human))
BDBM50573702
(CHEMBL4867229)
Show SMILES [H][C@@]12CCCN1C(=O)CNC(=O)CCCCCOC[C@H](NC2=O)C(=O)N[C@@H](CC(C)C)C(=O)[C@@]1(C)CO1 |r|
n/an/a>1.00E+4n/an/an/an/an/an/a
TBA
Citation and Details
Proteasome subunit beta type-9
(Homo sapiens (Human))
BDBM50573702
(CHEMBL4867229)
Show SMILES [H][C@@]12CCCN1C(=O)CNC(=O)CCCCCOC[C@H](NC2=O)C(=O)N[C@@H](CC(C)C)C(=O)[C@@]1(C)CO1 |r|
n/an/a>1.00E+4n/an/an/an/an/an/a
TBA
Citation and Details
Proteasome subunit beta type-8
(Homo sapiens (Human))
BDBM50573702
(CHEMBL4867229)
Show SMILES [H][C@@]12CCCN1C(=O)CNC(=O)CCCCCOC[C@H](NC2=O)C(=O)N[C@@H](CC(C)C)C(=O)[C@@]1(C)CO1 |r|
Reactome pathway
n/an/a>1.00E+4n/an/an/an/an/an/a
TBA
Citation and Details